restatus,educ1989,educ2003,educflag,monthdth,sex,age,ageflag,ager52,ager27,ager12,ager22,placdth,marstat,weekday,year,injwork,mandeath,methdisp,autopsy,activity,injury,ucod,ucr358,ucr113,ucr130,ucr39,eanum,econdp_1,econds_1,enicon_1,econdp_2,econds_2,enicon_2,econdp_3,econds_3,enicon_3,econdp_4,econds_4,enicon_4,econdp_5,econds_5,enicon_5,econdp_6,econds_6,enicon_6,econdp_7,econds_7,enicon_7,econdp_8,econds_8,enicon_8,econdp_9,econds_9,enicon_9,econdp_10,econds_10,enicon_10,econdp_11,econds_11,enicon_11,econdp_12,econds_12,enicon_12,econdp_13,econds_13,enicon_13,econdp_14,econds_14,enicon_14,econdp_15,econds_15,enicon_15,econdp_16,econds_16,enicon_16,econdp_17,econds_17,enicon_17,econdp_18,econds_18,enicon_18,econdp_19,econds_19,enicon_19,econdp_20,econds_20,enicon_20,ranum,record_1,record_2,record_3,record_4,record_5,record_6,record_7,record_8,record_9,record_10,record_11,record_12,record_13,record_14,record_15,record_16,record_17,record_18,record_19,record_20,race,brace,raceimp,racer3,racer5,hispanic,hspanicr
1,,6,1,1,F,1091,,44,24,11,,1,W,2,2018,U,7,C,N,,,I64,238,70,,24,6,1,1,J690,6,1,I119,6,2,I250,6,3,E149,6,4,I64,6,5,I694,,,,,,,,,,,,,,,,,,,,,,,,,,,,,,,,,,,,,,,,,,,6,I64,E149,I119,I250,I694,J690,,,,,,,,,,,,,,,7,,,2,4,100,8
1,,3,1,1,F,1083,,42,22,10,,1,W,2,2018,U,,B,N,,,A419,23,10,,37,3,1,1,I469,2,1,J189,2,2,A419,,,,,,,,,,,,,,,,,,,,,,,,,,,,,,,,,,,,,,,,,,,,,,,,,,,,3,A419,I469,J189,,,,,,,,,,,,,,,,,,58,,,2,4,100,8
1,,3,1,1,M,1068,,39,19,9,,1,M,3,2018,U,,B,N,,,A419,23,10,,37,4,1,1,I469,2,1,A419,6,1,I214,6,2,R02,,,,,,,,,,,,,,,,,,,,,,,,,,,,,,,,,,,,,,,,,,,,,,,,,4,A419,I214,I469,R02,,,,,,,,,,,,,,,,,58,,,2,4,100,8
1,,3,1,1,M,1042,,34,14,6,,3,M,3,2018,U,7,C,N,,,I119,207,56,,20,2,1,1,I119,6,1,E669,,,,,,,,,,,,,,,,,,,,,,,,,,,,,,,,,,,,,,,,,,,,,,,,,,,,,,,2,I119,E669,,,,,,,,,,,,,,,,,,,58,,,2,4,100,8
1,,1,1,1,F,1067,,39,19,9,,2,S,5,2018,U,7,C,N,,,I629,236,70,,24,4,1,1,I629,1,2,I64,6,1,I119,6,2,I250,,,,,,,,,,,,,,,,,,,,,,,,,,,,,,,,,,,,,,,,,,,,,,,,,3,I629,I119,I250,,,,,,,,,,,,,,,,,,7,,,2,4,100,8
1,,6,1,1,M,1035,,33,13,6,,3,S,5,2018,Y,2,C,N,9,5,X70,428,126,,40,4,1,1,T71,1,2,X70,2,1,T71,6,1,T71,,,,,,,,,,,,,,,,,,,,,,,,,,,,,,,,,,,,,,,,,,,,,,,,,2,X70,T71,,,,,,,,,,,,,,,,,,,8,,,2,4,100,8
1,,4,1,1,F,1084,,42,22,10,,4,M,5,2018,U,7,B,N,,,C259,88,25,,7,3,1,1,C259,6,1,I10,6,2,N185,,,,,,,,,,,,,,,,,,,,,,,,,,,,,,,,,,,,,,,,,,,,,,,,,,,,2,C259,I120,,,,,,,,,,,,,,,,,,,58,,,2,4,100,8
1,,1,1,1,M,4002,,4,1,1,4,1,S,5,2018,U,,B,N,,,P220,361,108,96,33,4,1,1,P269,2,1,P220,3,1,P073,6,1,P251,,,,,,,,,,,,,,,,,,,,,,,,,,,,,,,,,,,,,,,,,,,,,,,,,3,P220,P251,P269,,,,,,,,,,,,,,,,,,58,,,2,4,100,8
1,,2,1,1,M,1054,,36,16,7,,3,D,6,2018,U,7,B,N,,,I251,215,63,,21,2,1,1,I251,6,1,F179,,,,,,,,,,,,,,,,,,,,,,,,,,,,,,,,,,,,,,,,,,,,,,,,,,,,,,,2,I251,F179,,,,,,,,,,,,,,,,,,,7,,,2,4,100,8
1,,6,1,1,M,1081,,42,22,10,,4,W,6,2018,U,7,B,U,,,C19,82,23,,6,1,1,1,C19,,,,,,,,,,,,,,,,,,,,,,,,,,,,,,,,,,,,,,,,,,,,,,,,,,,,,,,,,,1,C19,,,,,,,,,,,,,,,,,,,,8,1,,2,4,100,8
1,,3,1,1,M,1063,,38,18,8,,3,M,6,2018,U,7,B,N,,,I250,214,62,,21,5,1,1,I119,1,2,I250,6,1,I714,6,2,F101,6,3,F179,,,,,,,,,,,,,,,,,,,,,,,,,,,,,,,,,,,,,,,,,,,,,,5,I250,F101,F179,I119,I714,,,,,,,,,,,,,,,,1,,,1,1,100,6
1,,2,1,1,M,1076,,41,21,10,,1,W,7,2018,U,,B,N,,,K922,306,111,,37,3,1,1,I469,2,1,R628,3,1,K922,,,,,,,,,,,,,,,,,,,,,,,,,,,,,,,,,,,,,,,,,,,,,,,,,,,,3,K922,I469,R628,,,,,,,,,,,,,,,,,,58,,,2,4,100,8
1,,3,1,1,M,1050,,36,16,7,,1,D,4,2018,U,7,B,N,,,I609,235,70,,24,4,1,1,R688,2,1,G935,3,1,I629,4,1,I609,,,,,,,,,,,,,,,,,,,,,,,,,,,,,,,,,,,,,,,,,,,,,,,,,3,I609,G935,R688,,,,,,,,,,,,,,,,,,7,,,2,4,100,8
1,,1,1,1,F,1079,,41,21,10,,1,M,6,2018,U,,B,N,,,A419,23,10,,37,4,1,1,I469,2,1,A419,6,1,K729,6,2,N19,,,,,,,,,,,,,,,,,,,,,,,,,,,,,,,,,,,,,,,,,,,,,,,,,4,A419,I469,K729,N19,,,,,,,,,,,,,,,,,58,,,2,4,100,8
1,,7,1,1,M,1084,,42,22,10,,1,M,6,2018,U,7,C,N,,,I214,211,59,,21,4,1,1,I214,6,1,I119,6,2,I250,6,3,F179,,,,,,,,,,,,,,,,,,,,,,,,,,,,,,,,,,,,,,,,,,,,,,,,,4,I214,F179,I119,I250,,,,,,,,,,,,,,,,,1,,,1,1,100,6
1,,8,1,1,M,1090,,44,24,11,,1,M,1,2018,U,,B,N,,,I214,211,59,,21,5,1,1,J81,2,1,I500,3,1,I214,6,1,I48,6,2,N179,,,,,,,,,,,,,,,,,,,,,,,,,,,,,,,,,,,,,,,,,,,,,,5,I214,I48,I500,J81,N179,,,,,,,,,,,,,,,,58,,,2,4,100,8
1,,2,1,1,M,1056,,37,17,8,,4,M,1,2018,U,7,C,N,,,B182,47,15,,37,4,1,1,K769,6,1,B182,6,2,I10,6,3,E669,,,,,,,,,,,,,,,,,,,,,,,,,,,,,,,,,,,,,,,,,,,,,,,,,3,B182,E669,I10,,,,,,,,,,,,,,,,,,58,,,2,4,100,8
1,,3,1,1,F,1072,,40,20,9,,1,S,1,2018,U,,B,N,,,C189,81,23,,6,3,1,1,J189,6,1,E149,6,2,C189,,,,,,,,,,,,,,,,,,,,,,,,,,,,,,,,,,,,,,,,,,,,,,,,,,,,3,C189,E149,J189,,,,,,,,,,,,,,,,,,58,,,2,4,100,8
1,,1,1,1,F,1090,,44,24,11,,1,M,1,2018,U,7,R,N,,,I64,238,70,,24,3,1,1,I64,6,1,I119,6,2,I250,,,,,,,,,,,,,,,,,,,,,,,,,,,,,,,,,,,,,,,,,,,,,,,,,,,,3,I64,I119,I250,,,,,,,,,,,,,,,,,,7,,,2,4,100,8
1,,1,1,1,F,1080,,42,22,10,,1,W,1,2018,U,7,B,N,,,G919,194,111,,37,3,1,1,I609,2,1,G919,3,1,I10,,,,,,,,,,,,,,,,,,,,,,,,,,,,,,,,,,,,,,,,,,,,,,,,,,,,3,G919,I10,I609,,,,,,,,,,,,,,,,,,7,,,2,4,100,8
1,,3,1,1,M,1036,,33,13,6,,3,S,2,2018,N,2,C,N,9,0,X70,428,126,,40,3,1,1,T71,1,2,X70,6,1,T71,,,,,,,,,,,,,,,,,,,,,,,,,,,,,,,,,,,,,,,,,,,,,,,,,,,,2,X70,T71,,,,,,,,,,,,,,,,,,,8,1,,2,4,100,8
1,,3,1,1,F,1079,,41,21,10,,1,W,3,2018,U,7,B,N,,,N185,327,100,,31,6,1,1,I469,2,1,N185,3,1,K922,6,1,R91,6,2,C80,6,3,F179,,,,,,,,,,,,,,,,,,,,,,,,,,,,,,,,,,,,,,,,,,,6,N185,C80,F179,I469,K922,R91,,,,,,,,,,,,,,,58,,,2,4,100,8
1,,3,1,1,M,1048,,35,15,7,,1,S,2,2018,U,7,C,N,,,E142,159,46,,16,4,1,1,N185,6,1,E149,6,2,I64,6,3,I694,,,,,,,,,,,,,,,,,,,,,,,,,,,,,,,,,,,,,,,,,,,,,,,,,3,E142,I64,I694,,,,,,,,,,,,,,,,,,58,,,2,4,100,8
1,,4,1,1,F,1084,,42,22,10,,1,W,3,2018,U,7,C,N,,,I250,214,62,,21,6,1,1,I119,1,2,I250,6,1,E149,6,2,J449,6,3,I64,6,4,I694,,,,,,,,,,,,,,,,,,,,,,,,,,,,,,,,,,,,,,,,,,,6,I250,E149,I119,I64,I694,J449,,,,,,,,,,,,,,,58,,,2,4,100,8
1,,6,1,1,F,1058,,37,17,8,,4,M,3,2018,U,7,C,N,,,C64,117,34,,12,1,1,1,C64,,,,,,,,,,,,,,,,,,,,,,,,,,,,,,,,,,,,,,,,,,,,,,,,,,,,,,,,,,1,C64,,,,,,,,,,,,,,,,,,,,58,,,2,4,100,8
1,,6,1,1,M,1074,,40,20,9,,3,W,5,2018,U,7,C,N,,,I250,214,62,,21,4,1,1,I119,1,2,I250,6,1,E149,6,2,N185,,,,,,,,,,,,,,,,,,,,,,,,,,,,,,,,,,,,,,,,,,,,,,,,,3,I250,E149,I131,,,,,,,,,,,,,,,,,,8,,,2,4,100,8
1,,3,1,1,M,1094,,44,24,11,,1,W,6,2018,U,,B,N,,,E149,159,46,,16,3,1,1,I469,2,1,L031,3,1,E149,,,,,,,,,,,,,,,,,,,,,,,,,,,,,,,,,,,,,,,,,,,,,,,,,,,,3,E149,I469,L031,,,,,,,,,,,,,,,,,,58,,,2,4,100,8
1,,5,1,1,M,1038,,33,13,6,,3,S,4,2018,N,2,B,N,9,0,X74,429,125,,40,3,1,1,S219,1,2,X74,6,1,S219,,,,,,,,,,,,,,,,,,,,,,,,,,,,,,,,,,,,,,,,,,,,,,,,,,,,2,X74,S219,,,,,,,,,,,,,,,,,,,58,,,2,4,100,8
1,,4,1,1,M,1057,,37,17,8,,1,M,5,2018,U,7,B,N,,,I119,207,56,,20,2,1,1,I119,6,1,E149,,,,,,,,,,,,,,,,,,,,,,,,,,,,,,,,,,,,,,,,,,,,,,,,,,,,,,,2,I119,E149,,,,,,,,,,,,,,,,,,,8,1,,2,4,100,8
1,,1,1,1,F,1073,,40,20,9,,1,W,6,2018,U,7,B,N,,,C80,125,43,,15,4,1,1,J969,1,2,I959,2,1,I269,3,1,C80,,,,,,,,,,,,,,,,,,,,,,,,,,,,,,,,,,,,,,,,,,,,,,,,,4,C80,I269,I959,J969,,,,,,,,,,,,,,,,,7,,,2,4,100,8
1,,1,1,1,F,5021,,2,1,1,2,1,S,7,2018,U,7,B,N,,,P369,363,108,106,33,5,1,1,P290,2,1,P219,3,1,P292,4,1,I959,5,1,P369,,,,,,,,,,,,,,,,,,,,,,,,,,,,,,,,,,,,,,,,,,,,,,5,P369,I959,P219,P290,P292,,,,,,,,,,,,,,,,8,,,2,4,100,8
1,,3,1,1,M,1083,,42,22,10,,3,W,1,2018,U,7,B,N,,,I250,214,62,,21,3,1,1,I119,1,2,I250,6,1,E149,,,,,,,,,,,,,,,,,,,,,,,,,,,,,,,,,,,,,,,,,,,,,,,,,,,,3,I250,E149,I119,,,,,,,,,,,,,,,,,,58,,,2,4,100,8
1,,2,1,1,F,1090,,44,24,11,,4,W,2,2018,U,7,B,U,,,G309,189,52,,17,2,1,1,G309,6,1,R636,,,,,,,,,,,,,,,,,,,,,,,,,,,,,,,,,,,,,,,,,,,,,,,,,,,,,,,2,G309,R636,,,,,,,,,,,,,,,,,,,58,,,2,4,100,8
1,,4,1,1,M,1056,,37,17,8,,4,M,2,2018,U,7,B,U,,,C221,86,24,,15,1,1,1,C221,,,,,,,,,,,,,,,,,,,,,,,,,,,,,,,,,,,,,,,,,,,,,,,,,,,,,,,,,,1,C221,,,,,,,,,,,,,,,,,,,,58,,,2,4,100,8
1,,9,1,1,M,1075,,41,21,10,,3,D,3,2018,U,7,C,N,,,R54,376,110,,36,1,1,1,R54,,,,,,,,,,,,,,,,,,,,,,,,,,,,,,,,,,,,,,,,,,,,,,,,,,,,,,,,,,1,R54,,,,,,,,,,,,,,,,,,,,58,,2,2,4,100,8
1,,3,1,1,M,1024,,30,10,4,,1,S,5,2018,Y,2,C,N,9,5,X70,428,126,,40,3,1,1,T71,1,2,X70,6,1,T71,,,,,,,,,,,,,,,,,,,,,,,,,,,,,,,,,,,,,,,,,,,,,,,,,,,,2,X70,T71,,,,,,,,,,,,,,,,,,,7,,,2,4,100,8
1,,2,1,1,F,1087,,43,23,11,,3,W,7,2018,U,7,B,N,,,I250,214,62,,21,4,1,1,I119,1,2,I250,6,1,E149,6,2,J459,,,,,,,,,,,,,,,,,,,,,,,,,,,,,,,,,,,,,,,,,,,,,,,,,4,I250,E149,I119,J459,,,,,,,,,,,,,,,,,58,,,2,4,100,8
1,,2,1,1,M,1078,,41,21,10,,1,M,1,2018,U,7,B,N,,,I251,215,63,,21,3,1,1,I469,2,1,I251,6,1,F179,,,,,,,,,,,,,,,,,,,,,,,,,,,,,,,,,,,,,,,,,,,,,,,,,,,,3,I251,F179,I469,,,,,,,,,,,,,,,,,,58,,,2,4,100,8
1,,1,1,1,F,1094,,44,24,11,,3,W,1,2018,U,7,C,N,,,I250,214,62,,21,2,1,1,I119,1,2,I250,,,,,,,,,,,,,,,,,,,,,,,,,,,,,,,,,,,,,,,,,,,,,,,,,,,,,,,2,I250,I119,,,,,,,,,,,,,,,,,,,5,,,2,4,100,8
1,,2,1,1,F,1069,,39,19,9,,1,D,1,2018,U,,B,N,,,M628,315,111,,37,6,1,1,A419,2,1,G009,3,1,M628,4,1,N288,5,1,R688,5,2,D65,,,,,,,,,,,,,,,,,,,,,,,,,,,,,,,,,,,,,,,,,,,6,M628,A419,D65,G009,N288,R688,,,,,,,,,,,,,,,58,,,2,4,100,8
1,,9,1,1,M,1053,,36,16,7,,1,S,3,2018,U,7,B,N,,,C349,93,27,,8,2,1,1,J969,2,1,C349,,,,,,,,,,,,,,,,,,,,,,,,,,,,,,,,,,,,,,,,,,,,,,,,,,,,,,,2,C349,J969,,,,,,,,,,,,,,,,,,,58,,,2,4,100,8
1,,1,1,1,M,1081,,42,22,10,,1,D,4,2018,U,7,C,N,,,C749,124,43,,15,4,1,1,C749,1,2,C80,6,1,E149,6,2,F179,,,,,,,,,,,,,,,,,,,,,,,,,,,,,,,,,,,,,,,,,,,,,,,,,3,C749,E149,F179,,,,,,,,,,,,,,,,,,58,,,2,4,100,8
1,,1,1,1,M,4025,,11,1,1,11,3,S,5,2018,U,7,B,Y,,,P239,362,108,98,33,1,1,1,P239,,,,,,,,,,,,,,,,,,,,,,,,,,,,,,,,,,,,,,,,,,,,,,,,,,,,,,,,,,1,P239,,,,,,,,,,,,,,,,,,,,8,,,2,4,100,8
1,,1,1,1,F,1086,,43,23,11,,1,W,7,2018,U,7,R,N,,,I219,211,59,,21,3,1,1,I219,6,1,I119,6,2,I250,,,,,,,,,,,,,,,,,,,,,,,,,,,,,,,,,,,,,,,,,,,,,,,,,,,,3,I219,I119,I250,,,,,,,,,,,,,,,,,,8,,,2,4,100,8
1,,3,1,1,F,1057,,37,17,8,,1,M,3,2018,U,7,B,N,,,C259,88,25,,7,6,1,1,A419,2,1,A498,3,1,C259,6,1,J969,6,2,N288,6,3,J90,,,,,,,,,,,,,,,,,,,,,,,,,,,,,,,,,,,,,,,,,,,6,C259,A419,A498,J90,J969,N288,,,,,,,,,,,,,,,8,1,,2,4,100,8
1,,1,1,1,M,1090,,44,24,11,,3,W,4,2018,U,7,B,N,,,I250,214,62,,21,3,1,1,I119,1,2,I250,6,1,J459,,,,,,,,,,,,,,,,,,,,,,,,,,,,,,,,,,,,,,,,,,,,,,,,,,,,3,I250,I119,J459,,,,,,,,,,,,,,,,,,7,,,2,4,100,8
1,,1,1,1,M,1081,,42,22,10,,1,S,5,2018,N,1,B,Y,9,,V092,397,114,,38,3,1,1,S129,1,2,S280,6,1,V092,,,,,,,,,,,,,,,,,,,,,,,,,,,,,,,,,,,,,,,,,,,,,,,,,,,,3,V092,S129,S280,,,,,,,,,,,,,,,,,,58,,,2,4,100,8
1,,3,1,1,F,1068,,39,19,9,,1,W,4,2018,U,7,B,N,,,I219,211,59,,21,6,1,1,I219,6,1,I119,6,2,I250,6,3,E149,6,4,N185,6,5,C509,,,,,,,,,,,,,,,,,,,,,,,,,,,,,,,,,,,,,,,,,,,5,I219,C509,E149,I131,I250,,,,,,,,,,,,,,,,7,,,2,4,100,8
1,,3,1,1,M,1064,,38,18,8,,1,S,4,2018,U,7,C,N,,,K746,300,95,,30,2,1,1,K746,6,1,J90,,,,,,,,,,,,,,,,,,,,,,,,,,,,,,,,,,,,,,,,,,,,,,,,,,,,,,,2,K746,J90,,,,,,,,,,,,,,,,,,,58,,,2,4,100,8
1,,3,1,1,M,1078,,41,21,10,,3,M,6,2018,U,7,B,N,,,I250,214,62,,21,4,1,1,I119,1,2,I250,6,1,E149,6,2,F179,,,,,,,,,,,,,,,,,,,,,,,,,,,,,,,,,,,,,,,,,,,,,,,,,4,I250,E149,F179,I119,,,,,,,,,,,,,,,,,7,,,2,4,100,8
1,,1,1,1,F,1090,,44,24,11,,1,W,7,2018,U,7,B,N,,,I250,214,62,,21,2,1,1,I119,1,2,I250,,,,,,,,,,,,,,,,,,,,,,,,,,,,,,,,,,,,,,,,,,,,,,,,,,,,,,,2,I250,I119,,,,,,,,,,,,,,,,,,,7,,,2,4,100,8
1,,2,1,1,M,1088,,43,23,11,,4,M,2,2018,U,7,B,U,,,N189,327,100,,31,3,1,1,N189,2,1,F03,3,1,R628,,,,,,,,,,,,,,,,,,,,,,,,,,,,,,,,,,,,,,,,,,,,,,,,,,,,3,N189,F03,R628,,,,,,,,,,,,,,,,,,7,,,2,4,100,8
1,,7,1,1,M,1073,,40,20,9,,1,D,1,2018,U,,B,N,,,K769,301,111,,37,1,1,1,K769,,,,,,,,,,,,,,,,,,,,,,,,,,,,,,,,,,,,,,,,,,,,,,,,,,,,,,,,,,1,K769,,,,,,,,,,,,,,,,,,,,1,,,1,1,100,6
1,,3,1,1,M,1064,,38,18,8,,1,M,1,2018,U,7,C,N,,,C760,125,43,,15,3,1,1,C760,6,1,I10,6,2,E149,,,,,,,,,,,,,,,,,,,,,,,,,,,,,,,,,,,,,,,,,,,,,,,,,,,,3,C760,E149,I10,,,,,,,,,,,,,,,,,,8,,,2,4,100,8
1,,3,1,1,M,1059,,37,17,8,,1,S,2,2018,N,1,U,N,9,0,W19,406,118,,39,4,1,1,S129,2,1,W19,6,1,T519,6,2,X45,,,,,,,,,,,,,,,,,,,,,,,,,,,,,,,,,,,,,,,,,,,,,,,,,4,W19,S129,T519,X45,,,,,,,,,,,,,,,,,8,,,2,4,100,8
1,,1,1,1,M,1063,,38,18,8,,1,M,3,2018,U,7,C,N,,,I250,214,62,,21,2,1,1,I119,1,2,I250,,,,,,,,,,,,,,,,,,,,,,,,,,,,,,,,,,,,,,,,,,,,,,,,,,,,,,,2,I250,I119,,,,,,,,,,,,,,,,,,,7,,,2,4,100,8
1,,2,1,1,F,1063,,38,18,8,,1,M,5,2018,U,7,B,N,,,I219,211,59,,21,7,1,1,I219,6,1,I119,6,2,I250,6,3,E149,6,4,J449,6,5,I64,6,6,F179,,,,,,,,,,,,,,,,,,,,,,,,,,,,,,,,,,,,,,,,7,I219,E149,F179,I119,I250,I64,J449,,,,,,,,,,,,,,58,,,2,4,100,8
1,,4,1,1,M,1090,,44,24,11,,3,M,7,2018,U,7,B,N,,,I250,214,62,,21,5,1,1,I119,1,2,I250,6,1,E149,6,2,G20,6,3,F03,,,,,,,,,,,,,,,,,,,,,,,,,,,,,,,,,,,,,,,,,,,,,,5,I250,E149,F03,G20,I119,,,,,,,,,,,,,,,,7,,,2,4,100,8
3,,3,1,1,F,1055,,37,17,8,,1,S,1,2018,U,7,R,N,,,C069,75,20,,15,5,1,1,J189,6,1,N185,6,2,E149,6,3,I10,6,4,C069,,,,,,,,,,,,,,,,,,,,,,,,,,,,,,,,,,,,,,,,,,,,,,4,C069,E142,I10,J189,,,,,,,,,,,,,,,,,8,,,2,4,100,8
1,,4,1,1,M,1075,,41,21,10,,1,M,1,2018,U,7,R,N,,,I64,238,70,,24,5,1,1,I64,6,1,I119,6,2,I250,6,3,G309,6,4,F179,,,,,,,,,,,,,,,,,,,,,,,,,,,,,,,,,,,,,,,,,,,,,,5,I64,F179,G309,I119,I250,,,,,,,,,,,,,,,,8,,,2,4,100,8
1,,1,1,1,F,1057,,37,17,8,,1,D,7,2018,U,7,D,N,,9,I639,237,70,,24,6,1,1,J960,2,1,J981,3,1,T179,3,2,W80,4,1,I639,5,1,I358,,,,,,,,,,,,,,,,,,,,,,,,,,,,,,,,,,,,,,,,,,,6,I639,I358,J960,J981,T179,W80,,,,,,,,,,,,,,,58,,,2,4,100,8
1,,2,1,1,M,1045,,35,15,7,,1,S,1,2018,U,7,C,N,,,I219,211,59,,21,1,1,1,I219,,,,,,,,,,,,,,,,,,,,,,,,,,,,,,,,,,,,,,,,,,,,,,,,,,,,,,,,,,1,I219,,,,,,,,,,,,,,,,,,,,7,,,2,4,100,8
1,,2,1,1,M,1055,,37,17,8,,1,M,1,2018,U,,B,N,,,M869,318,111,,37,2,1,1,M869,2,1,A499,,,,,,,,,,,,,,,,,,,,,,,,,,,,,,,,,,,,,,,,,,,,,,,,,,,,,,,2,M869,A499,,,,,,,,,,,,,,,,,,,8,,,2,4,100,8
1,,6,1,1,M,1061,,38,18,8,,3,M,1,2018,U,7,R,N,,,I250,214,62,,21,1,1,1,I250,,,,,,,,,,,,,,,,,,,,,,,,,,,,,,,,,,,,,,,,,,,,,,,,,,,,,,,,,,1,I250,,,,,,,,,,,,,,,,,,,,7,,,2,4,100,8
1,,7,1,1,M,1045,,35,15,7,,3,D,3,2018,U,7,D,N,,,I119,207,56,,20,1,1,1,I119,,,,,,,,,,,,,,,,,,,,,,,,,,,,,,,,,,,,,,,,,,,,,,,,,,,,,,,,,,1,I119,,,,,,,,,,,,,,,,,,,,58,,,2,4,100,8
1,,1,1,1,F,1078,,41,21,10,,1,W,3,2018,U,7,B,N,,,N288,331,111,,37,5,1,1,R570,2,1,N288,3,1,R579,4,1,J969,6,1,F179,,,,,,,,,,,,,,,,,,,,,,,,,,,,,,,,,,,,,,,,,,,,,,5,N288,F179,J969,R570,R579,,,,,,,,,,,,,,,,8,,,2,4,282,5
1,,2,1,1,M,1019,,29,9,4,,3,S,4,2018,U,7,B,N,,,I251,215,63,,21,3,1,1,I251,6,1,J459,6,2,E669,,,,,,,,,,,,,,,,,,,,,,,,,,,,,,,,,,,,,,,,,,,,,,,,,,,,3,I251,E669,J459,,,,,,,,,,,,,,,,,,58,,,2,4,100,8
1,,1,1,1,F,1075,,41,21,10,,2,W,7,2018,U,7,R,N,,,I250,214,62,,21,2,1,1,I119,1,2,I250,,,,,,,,,,,,,,,,,,,,,,,,,,,,,,,,,,,,,,,,,,,,,,,,,,,,,,,2,I250,I119,,,,,,,,,,,,,,,,,,,8,,,2,4,100,8
1,,4,1,1,M,1068,,39,19,9,,4,D,4,2018,U,7,C,N,,,C64,117,34,,12,3,1,1,C64,6,1,I10,6,2,E149,,,,,,,,,,,,,,,,,,,,,,,,,,,,,,,,,,,,,,,,,,,,,,,,,,,,3,C64,E149,I10,,,,,,,,,,,,,,,,,,7,,,2,4,100,8
1,,3,1,1,M,1073,,40,20,9,,3,M,3,2018,U,7,C,N,,,I250,214,62,,21,3,1,1,I119,1,2,I250,6,1,E149,,,,,,,,,,,,,,,,,,,,,,,,,,,,,,,,,,,,,,,,,,,,,,,,,,,,3,I250,E149,I119,,,,,,,,,,,,,,,,,,7,,,2,4,100,8
1,,3,1,1,F,1052,,36,16,7,,1,M,3,2018,U,7,B,N,,,C349,93,27,,8,1,1,1,C349,,,,,,,,,,,,,,,,,,,,,,,,,,,,,,,,,,,,,,,,,,,,,,,,,,,,,,,,,,1,C349,,,,,,,,,,,,,,,,,,,,8,1,,2,4,100,8
1,,3,1,1,M,1066,,39,19,9,,4,M,4,2018,U,7,C,N,,,C349,93,27,,8,4,1,1,C349,1,2,C787,1,3,C795,6,1,F179,,,,,,,,,,,,,,,,,,,,,,,,,,,,,,,,,,,,,,,,,,,,,,,,,4,C349,C787,C795,F179,,,,,,,,,,,,,,,,,58,,,2,4,100,8
1,,1,1,1,M,1067,,39,19,9,,1,W,5,2018,U,7,R,N,,,J440,267,86,,28,6,1,1,J189,6,1,I10,6,2,J449,6,3,C349,6,4,C80,6,5,F179,,,,,,,,,,,,,,,,,,,,,,,,,,,,,,,,,,,,,,,,,,,4,J440,C349,F179,I10,,,,,,,,,,,,,,,,,8,,,2,4,100,8
1,,2,1,1,F,1063,,38,18,8,,1,M,5,2018,U,,B,N,,,I219,211,59,,21,4,1,1,I219,2,1,I251,3,1,I739,6,1,F179,,,,,,,,,,,,,,,,,,,,,,,,,,,,,,,,,,,,,,,,,,,,,,,,,4,I219,F179,I251,I739,,,,,,,,,,,,,,,,,58,,,2,4,100,8
1,,8,1,1,M,1070,,40,20,9,,2,M,6,2018,U,7,C,N,,,I250,214,62,,21,4,1,1,I119,1,2,I250,6,1,E149,6,2,N185,,,,,,,,,,,,,,,,,,,,,,,,,,,,,,,,,,,,,,,,,,,,,,,,,3,I250,E149,I131,,,,,,,,,,,,,,,,,,58,,,2,4,100,8
1,,1,1,1,F,1093,,44,24,11,,3,W,6,2018,U,7,B,N,,,I250,214,62,,21,2,1,1,I119,1,2,I250,,,,,,,,,,,,,,,,,,,,,,,,,,,,,,,,,,,,,,,,,,,,,,,,,,,,,,,2,I250,I119,,,,,,,,,,,,,,,,,,,58,,,2,4,100,8
1,,9,1,1,M,1047,,35,15,7,,3,S,2,2018,U,7,C,N,,,I119,207,56,,20,3,1,1,I119,6,1,E149,6,2,G610,,,,,,,,,,,,,,,,,,,,,,,,,,,,,,,,,,,,,,,,,,,,,,,,,,,,3,I119,E149,G610,,,,,,,,,,,,,,,,,,58,,,2,4,100,8
1,,3,1,1,M,1059,,37,17,8,,1,S,4,2018,U,7,B,N,,,J189,257,78,,27,4,1,1,J189,6,1,I10,6,2,E149,6,3,N185,,,,,,,,,,,,,,,,,,,,,,,,,,,,,,,,,,,,,,,,,,,,,,,,,3,J189,E149,I120,,,,,,,,,,,,,,,,,,58,,,2,4,100,8
1,,9,1,1,M,1073,,40,20,9,,1,M,5,2018,U,,B,N,,,A099,11,3,,37,2,1,1,N179,2,1,A099,,,,,,,,,,,,,,,,,,,,,,,,,,,,,,,,,,,,,,,,,,,,,,,,,,,,,,,2,A099,N179,,,,,,,,,,,,,,,,,,,58,,1,2,4,100,8
1,,1,1,1,F,1095,,45,25,11,,1,W,5,2018,U,,B,N,,,E149,159,46,,16,2,1,1,I250,2,1,E149,,,,,,,,,,,,,,,,,,,,,,,,,,,,,,,,,,,,,,,,,,,,,,,,,,,,,,,2,E149,I250,,,,,,,,,,,,,,,,,,,7,,,2,4,100,8
1,,3,1,1,M,1077,,41,21,10,,2,M,2,2018,U,7,C,N,,,I250,214,62,,21,5,1,1,I119,1,2,I250,6,1,E149,6,2,I64,6,3,I694,,,,,,,,,,,,,,,,,,,,,,,,,,,,,,,,,,,,,,,,,,,,,,5,I250,E149,I119,I64,I694,,,,,,,,,,,,,,,,7,,,2,4,100,8
1,,3,1,1,M,1079,,41,21,10,,4,M,3,2018,U,,B,U,,,C349,93,27,,8,4,1,1,C349,2,1,I509,3,1,N189,6,1,F179,,,,,,,,,,,,,,,,,,,,,,,,,,,,,,,,,,,,,,,,,,,,,,,,,4,C349,F179,I509,N189,,,,,,,,,,,,,,,,,58,,,2,4,100,8
1,,3,1,1,M,1063,,38,18,8,,1,W,2,2018,U,7,B,N,,,K746,300,95,,30,4,1,1,R570,2,1,R578,3,1,K922,4,1,K746,,,,,,,,,,,,,,,,,,,,,,,,,,,,,,,,,,,,,,,,,,,,,,,,,4,K746,K922,R570,R578,,,,,,,,,,,,,,,,,58,,,2,4,100,8
1,,9,1,1,F,1062,,38,18,8,,1,M,6,2018,U,,U,N,,,I250,214,62,,21,4,1,1,G319,1,2,J841,2,1,I250,3,1,L409,,,,,,,,,,,,,,,,,,,,,,,,,,,,,,,,,,,,,,,,,,,,,,,,,4,I250,G319,J841,L409,,,,,,,,,,,,,,,,,58,,,2,4,100,8
1,,2,1,1,M,1057,,37,17,8,,1,M,3,2018,U,,B,N,,,I619,236,70,,24,5,1,1,R092,2,1,I619,6,1,E789,6,2,I10,6,3,I619,,,,,,,,,,,,,,,,,,,,,,,,,,,,,,,,,,,,,,,,,,,,,,4,I619,E789,I10,R092,,,,,,,,,,,,,,,,,58,,,2,4,100,8
1,,3,1,1,M,1083,,42,22,10,,1,M,4,2018,U,,B,N,,9,C61,113,33,,11,5,1,1,C61,6,1,S720,6,2,I48,6,3,F179,6,4,X590,,,,,,,,,,,,,,,,,,,,,,,,,,,,,,,,,,,,,,,,,,,,,,5,C61,F179,I48,S720,X590,,,,,,,,,,,,,,,,58,,,2,4,100,8
1,,4,1,1,M,1063,,38,18,8,,1,M,4,2018,U,7,C,N,,,C61,113,33,,11,5,1,1,C780,1,2,C61,1,3,C795,6,1,J449,6,2,F179,,,,,,,,,,,,,,,,,,,,,,,,,,,,,,,,,,,,,,,,,,,,,,5,C61,C780,C795,F179,J449,,,,,,,,,,,,,,,,58,,,2,4,100,8
1,,3,1,2,F,1083,,42,22,10,,3,W,5,2018,U,7,C,N,,,I250,214,62,,21,3,1,1,I119,1,2,I250,6,1,K746,,,,,,,,,,,,,,,,,,,,,,,,,,,,,,,,,,,,,,,,,,,,,,,,,,,,3,I250,I119,K746,,,,,,,,,,,,,,,,,,1,,,1,1,100,6
1,,3,1,2,F,1072,,40,20,9,,3,D,6,2018,U,7,B,N,,,C349,93,27,,8,3,1,1,C349,1,2,C80,6,1,I10,,,,,,,,,,,,,,,,,,,,,,,,,,,,,,,,,,,,,,,,,,,,,,,,,,,,2,C349,I10,,,,,,,,,,,,,,,,,,,58,,,2,4,100,8
1,,3,1,2,M,1066,,39,19,9,,3,D,6,2018,U,7,C,N,,,C159,77,21,,15,2,1,1,C159,6,1,I10,,,,,,,,,,,,,,,,,,,,,,,,,,,,,,,,,,,,,,,,,,,,,,,,,,,,,,,2,C159,I10,,,,,,,,,,,,,,,,,,,58,,,2,4,100,8
1,,2,1,2,F,1045,,35,15,7,,1,M,7,2018,U,,B,U,,,C859,129,39,,13,7,1,1,I469,2,1,D70,2,2,A419,3,1,C859,6,1,D619,6,2,D696,6,3,N185,,,,,,,,,,,,,,,,,,,,,,,,,,,,,,,,,,,,,,,,7,C859,A419,D619,D696,D70,I469,N185,,,,,,,,,,,,,,58,,,2,4,100,8
1,,4,1,2,M,1054,,36,16,7,,1,S,1,2018,U,7,B,N,,,I219,211,59,,21,4,1,1,I219,2,1,I330,6,1,I639,6,2,I609,,,,,,,,,,,,,,,,,,,,,,,,,,,,,,,,,,,,,,,,,,,,,,,,,4,I219,I330,I609,I639,,,,,,,,,,,,,,,,,58,,,2,4,100,8
1,,4,1,2,M,1082,,42,22,10,,1,W,3,2018,U,7,B,N,,,G20,188,51,,37,3,1,1,R092,2,1,G20,3,1,L893,,,,,,,,,,,,,,,,,,,,,,,,,,,,,,,,,,,,,,,,,,,,,,,,,,,,3,G20,L893,R092,,,,,,,,,,,,,,,,,,58,,,2,4,100,8
1,,2,1,1,M,1058,,37,17,8,,1,S,2,2018,U,7,R,N,,,I250,214,62,,21,4,1,1,I119,1,2,I250,6,1,E149,6,2,N185,,,,,,,,,,,,,,,,,,,,,,,,,,,,,,,,,,,,,,,,,,,,,,,,,3,I250,E149,I131,,,,,,,,,,,,,,,,,,8,,,2,4,100,8
1,,2,1,2,M,1048,,35,15,7,,4,M,6,2018,U,7,C,N,,,C069,75,20,,15,2,1,1,C069,1,2,C80,,,,,,,,,,,,,,,,,,,,,,,,,,,,,,,,,,,,,,,,,,,,,,,,,,,,,,,1,C069,,,,,,,,,,,,,,,,,,,,1,,2,1,1,210,1
1,,3,1,2,M,1040,,34,14,6,,1,S,6,2018,U,,B,N,,,A419,23,10,,37,2,1,1,I469,2,1,A419,,,,,,,,,,,,,,,,,,,,,,,,,,,,,,,,,,,,,,,,,,,,,,,,,,,,,,,2,A419,I469,,,,,,,,,,,,,,,,,,,58,,,2,4,100,8
1,,3,1,2,M,1064,,38,18,8,,2,M,1,2018,U,7,B,N,,,I219,211,59,,21,5,1,1,I219,2,1,I251,6,1,I10,6,2,E149,6,3,F179,,,,,,,,,,,,,,,,,,,,,,,,,,,,,,,,,,,,,,,,,,,,,,5,I219,E149,F179,I10,I251,,,,,,,,,,,,,,,,58,,,2,4,100,8
1,,2,1,2,M,1088,,43,23,11,,1,W,1,2018,U,7,B,N,,,I219,211,59,,21,2,1,1,I219,6,1,I251,,,,,,,,,,,,,,,,,,,,,,,,,,,,,,,,,,,,,,,,,,,,,,,,,,,,,,,2,I219,I251,,,,,,,,,,,,,,,,,,,58,,,2,4,100,8
1,,3,1,2,F,1083,,42,22,10,,3,W,2,2018,U,7,B,N,,,C169,78,22,,5,5,1,1,C169,6,1,J449,6,2,E149,6,3,I10,6,4,F179,,,,,,,,,,,,,,,,,,,,,,,,,,,,,,,,,,,,,,,,,,,,,,5,C169,E149,F179,I10,J449,,,,,,,,,,,,,,,,58,,,2,4,100,8
1,,1,1,2,F,1098,,45,25,11,,4,W,2,2018,U,7,B,U,,,J841,278,89,,37,2,1,1,J984,1,2,J841,,,,,,,,,,,,,,,,,,,,,,,,,,,,,,,,,,,,,,,,,,,,,,,,,,,,,,,1,J841,,,,,,,,,,,,,,,,,,,,58,,,2,4,100,8
1,,4,1,2,F,1050,,36,16,7,,2,M,3,2018,U,7,B,N,,,I219,211,59,,21,3,1,1,I219,2,1,I251,6,1,I10,,,,,,,,,,,,,,,,,,,,,,,,,,,,,,,,,,,,,,,,,,,,,,,,,,,,3,I219,I10,I251,,,,,,,,,,,,,,,,,,58,,,2,4,100,8
1,,9,1,1,M,1021,,30,10,4,,3,S,6,2018,N,2,R,N,9,0,X70,428,126,,40,4,1,1,T71,1,2,X70,2,1,T71,6,1,T71,,,,,,,,,,,,,,,,,,,,,,,,,,,,,,,,,,,,,,,,,,,,,,,,,2,X70,T71,,,,,,,,,,,,,,,,,,,8,,,2,4,100,8
1,,3,1,2,M,1028,,31,11,5,,3,S,7,2018,U,7,R,N,,,C19,82,23,,6,3,1,1,C19,1,2,C80,6,1,K759,,,,,,,,,,,,,,,,,,,,,,,,,,,,,,,,,,,,,,,,,,,,,,,,,,,,2,C19,K759,,,,,,,,,,,,,,,,,,,8,,,2,4,100,8
1,,9,1,2,F,1098,,45,25,11,,1,W,4,2018,U,,B,N,,,J189,257,78,,27,1,1,1,J189,,,,,,,,,,,,,,,,,,,,,,,,,,,,,,,,,,,,,,,,,,,,,,,,,,,,,,,,,,1,J189,,,,,,,,,,,,,,,,,,,,58,,,2,4,100,8
1,,2,1,2,M,1075,,41,21,10,,1,M,5,2018,U,7,B,N,,,I219,211,59,,21,1,1,1,I219,,,,,,,,,,,,,,,,,,,,,,,,,,,,,,,,,,,,,,,,,,,,,,,,,,,,,,,,,,1,I219,,,,,,,,,,,,,,,,,,,,58,,,2,4,100,8
1,,2,1,2,F,1051,,36,16,7,,2,S,3,2018,U,7,C,N,,,J459,268,85,,28,4,1,1,J189,6,1,I10,6,2,E149,6,3,J459,,,,,,,,,,,,,,,,,,,,,,,,,,,,,,,,,,,,,,,,,,,,,,,,,4,J459,E149,I10,J189,,,,,,,,,,,,,,,,,8,,,2,4,100,8
1,,7,1,2,M,1091,,44,24,11,,3,M,7,2018,U,7,B,N,,,I250,214,62,,21,5,1,1,I119,1,2,I250,6,1,E149,6,2,J449,6,3,F179,,,,,,,,,,,,,,,,,,,,,,,,,,,,,,,,,,,,,,,,,,,,,,5,I250,E149,F179,I119,J449,,,,,,,,,,,,,,,,8,1,,2,4,100,8
1,,8,1,2,M,1079,,41,21,10,,1,M,7,2018,U,7,C,N,,,J189,257,78,,27,5,1,1,J189,6,1,I119,6,2,I250,6,3,E149,6,4,I251,,,,,,,,,,,,,,,,,,,,,,,,,,,,,,,,,,,,,,,,,,,,,,5,J189,E149,I119,I250,I251,,,,,,,,,,,,,,,,1,,,1,1,100,6
1,,3,1,2,M,1032,,32,12,5,,1,S,7,2018,N,1,R,Y,9,,V092,397,114,,38,3,1,1,S029,1,2,S129,6,1,V092,,,,,,,,,,,,,,,,,,,,,,,,,,,,,,,,,,,,,,,,,,,,,,,,,,,,3,V092,S029,S129,,,,,,,,,,,,,,,,,,8,,,2,4,100,8
1,,3,1,2,F,1058,,37,17,8,,3,W,5,2018,U,7,B,N,,,I250,214,62,,21,2,1,1,I119,1,2,I250,,,,,,,,,,,,,,,,,,,,,,,,,,,,,,,,,,,,,,,,,,,,,,,,,,,,,,,2,I250,I119,,,,,,,,,,,,,,,,,,,58,,,2,4,100,8
1,,4,1,2,F,1064,,38,18,8,,3,M,6,2018,U,7,C,N,,,I250,214,62,,21,5,1,1,I119,1,2,I250,6,1,E149,6,2,I251,6,3,E669,,,,,,,,,,,,,,,,,,,,,,,,,,,,,,,,,,,,,,,,,,,,,,5,I250,E149,E669,I119,I251,,,,,,,,,,,,,,,,58,,,2,4,100,8
1,,2,1,2,F,1077,,41,21,10,,4,W,7,2018,U,7,B,U,,,F03,175,111,,37,1,1,1,F03,,,,,,,,,,,,,,,,,,,,,,,,,,,,,,,,,,,,,,,,,,,,,,,,,,,,,,,,,,1,F03,,,,,,,,,,,,,,,,,,,,58,,,2,4,100,8
1,,1,1,2,M,1045,,35,15,7,,2,M,7,2018,U,7,R,N,,,E149,159,46,,16,2,1,1,E149,1,2,L031,,,,,,,,,,,,,,,,,,,,,,,,,,,,,,,,,,,,,,,,,,,,,,,,,,,,,,,2,E149,L031,,,,,,,,,,,,,,,,,,,8,,,2,4,100,8
1,,6,1,2,M,1081,,42,22,10,,3,D,2,2018,U,7,C,N,,,I250,214,62,,21,4,1,1,I119,1,2,I250,6,1,I251,6,2,C446,,,,,,,,,,,,,,,,,,,,,,,,,,,,,,,,,,,,,,,,,,,,,,,,,4,I250,C446,I119,I251,,,,,,,,,,,,,,,,,1,,,1,1,100,6
1,,6,1,2,M,1038,,33,13,6,,3,D,5,2018,N,2,B,N,9,0,X70,428,126,,40,3,1,1,T71,1,2,X70,6,1,T71,,,,,,,,,,,,,,,,,,,,,,,,,,,,,,,,,,,,,,,,,,,,,,,,,,,,2,X70,T71,,,,,,,,,,,,,,,,,,,7,,,2,4,100,8
1,,2,1,2,M,1067,,39,19,9,,1,M,6,2018,U,,B,N,,,I219,211,59,,21,4,1,1,I469,2,1,J81,3,1,I219,6,1,F179,,,,,,,,,,,,,,,,,,,,,,,,,,,,,,,,,,,,,,,,,,,,,,,,,4,I219,F179,I469,J81,,,,,,,,,,,,,,,,,58,,,2,4,100,8
1,,1,1,2,M,1092,,44,24,11,,1,W,6,2018,U,7,C,N,,,I250,214,62,,21,7,1,1,I119,1,2,I250,6,1,E149,6,2,J449,6,3,I64,6,4,I694,6,5,F179,,,,,,,,,,,,,,,,,,,,,,,,,,,,,,,,,,,,,,,,7,I250,E149,F179,I119,I64,I694,J449,,,,,,,,,,,,,,58,,,2,4,100,8
1,,3,1,2,F,1078,,41,21,10,,4,M,3,2018,U,7,B,U,,,C189,81,23,,6,3,1,1,C189,2,1,E149,3,1,K566,,,,,,,,,,,,,,,,,,,,,,,,,,,,,,,,,,,,,,,,,,,,,,,,,,,,3,C189,E149,K566,,,,,,,,,,,,,,,,,,7,,,2,4,100,8