"restatus","educ1989","educ2003","educflag","monthdth","sex","age","ageflag","ager52","ager27","ager12","ager22","placdth","marstat","weekday","year","injwork","mandeath","methdisp","autopsy","activity","injury","ucod","ucr358","ucr113","ucr130","ucr39","eanum","econdp_1","econds_1","enicon_1","econdp_2","econds_2","enicon_2","econdp_3","econds_3","enicon_3","econdp_4","econds_4","enicon_4","econdp_5","econds_5","enicon_5","econdp_6","econds_6","enicon_6","econdp_7","econds_7","enicon_7","econdp_8","econds_8","enicon_8","econdp_9","econds_9","enicon_9","econdp_10","econds_10","enicon_10","econdp_11","econds_11","enicon_11","econdp_12","econds_12","enicon_12","econdp_13","econds_13","enicon_13","econdp_14","econds_14","enicon_14","econdp_15","econds_15","enicon_15","econdp_16","econds_16","enicon_16","econdp_17","econds_17","enicon_17","econdp_18","econds_18","enicon_18","econdp_19","econds_19","enicon_19","econdp_20","econds_20","enicon_20","ranum","record_1","record_2","record_3","record_4","record_5","record_6","record_7","record_8","record_9","record_10","record_11","record_12","record_13","record_14","record_15","record_16","record_17","record_18","record_19","record_20","race","brace","raceimp","racer3","racer5","hispanic","hspanicr"
1,99,,2,1,"M",1006,,27,7,3,,1,"S",2,2017,"N",,"U","U",9,,"V892",397,114,,38,6,1,1,"R688",2,1,"T149",2,2,"V892",2,3,"I509",2,4,"J969",2,5,"N19",,,,,,,,,,,,,,,,,,,,,,,,,,,,,,,,,,,,,,,,,,,6,"V892","I509","J969","N19","R688","T149",,,,,,,,,,,,,,,8,,,2,4,998,9
1,99,,2,1,"F",1057,,37,17,8,,2,"M",2,2017,"U",,"U","N",,,"N185",327,100,,31,4,1,1,"I619",2,1,"R090",3,1,"R568",4,1,"N185",,,,,,,,,,,,,,,,,,,,,,,,,,,,,,,,,,,,,,,,,,,,,,,,,4,"N185","I619","R090","R568",,,,,,,,,,,,,,,,,8,,,2,4,998,9
1,99,,2,1,"F",1101,,46,26,11,,1,"W",3,2017,"U",,"U","N",,,"E46",167,48,,37,6,1,1,"A419",2,1,"N390",3,1,"L899",4,1,"E46",4,2,"R54",4,3,"R263",,,,,,,,,,,,,,,,,,,,,,,,,,,,,,,,,,,,,,,,,,,6,"E46","A419","L899","N390","R263","R54",,,,,,,,,,,,,,,8,,,2,4,998,9
1,99,,2,1,"F",1049,,35,15,7,,1,"W",6,2017,"U",,"U","N",,,"C509",104,29,,9,5,1,1,"A419",2,1,"J189",3,1,"D696",4,1,"C509",4,2,"M259",,,,,,,,,,,,,,,,,,,,,,,,,,,,,,,,,,,,,,,,,,,,,,5,"C509","A419","D696","J189","M259",,,,,,,,,,,,,,,,8,,,2,4,998,9
1,99,,2,1,"F",1040,,34,14,6,,1,"M",1,2017,"U",,"U","N",,,"E140",159,46,,16,11,1,1,"R402",2,1,"E870",2,2,"R739",3,1,"E149",3,2,"A419",3,3,"N179",4,1,"E878",4,2,"E871",4,3,"C20",6,1,"I959",6,2,"K922",,,,,,,,,,,,,,,,,,,,,,,,,,,,10,"E140","A419","C20","E870","E871","E878","I959","K922","N179","R739",,,,,,,,,,,8,,,2,4,998,9
1,99,,2,1,"F",1062,,38,18,8,,1,"D",1,2017,"U",,"U","N",,,"I38",226,68,,22,4,1,1,"I620",2,1,"Y442",3,1,"I48",3,2,"I38",,,,,,,,,,,,,,,,,,,,,,,,,,,,,,,,,,,,,,,,,,,,,,,,,4,"I38","I48","I620","Y442",,,,,,,,,,,,,,,,,8,,,2,4,998,9
1,99,,2,1,"F",1068,,39,19,9,,3,"W",3,2017,"U",,"U","N",,,"C509",104,29,,9,3,1,1,"C509",6,1,"I350",6,2,"E149",,,,,,,,,,,,,,,,,,,,,,,,,,,,,,,,,,,,,,,,,,,,,,,,,,,,3,"C509","E149","I350",,,,,,,,,,,,,,,,,,8,,,2,4,998,9
1,99,,2,1,"F",1072,,40,20,9,,1,"W",4,2017,"U",,"U","N",,,"I120",208,69,,23,9,1,1,"J80",1,2,"C349",1,3,"C80",2,1,"J189",3,1,"I10",6,1,"N185",6,2,"D649",6,3,"M109",6,4,"R54",,,,,,,,,,,,,,,,,,,,,,,,,,,,,,,,,,7,"I120","C349","D649","J189","J80","M109","R54",,,,,,,,,,,,,,8,,,2,4,998,9
1,99,,2,1,"M",1026,,31,11,5,,3,"M",7,2017,"Y",1,"U","Y",9,9,"W87",412,123,,39,3,1,1,"I461",2,1,"T754",2,2,"W87",,,,,,,,,,,,,,,,,,,,,,,,,,,,,,,,,,,,,,,,,,,,,,,,,,,,3,"W87","I461","T754",,,,,,,,,,,,,,,,,,8,,,2,4,998,9
1,99,,2,1,"F",1072,,40,20,9,,1,"D",7,2017,"U",,"U","N",,,"L984",309,111,,37,5,1,1,"A419",2,1,"J189",3,1,"L984",6,1,"R190",6,2,"A490",,,,,,,,,,,,,,,,,,,,,,,,,,,,,,,,,,,,,,,,,,,,,,5,"L984","A419","A490","J189","R190",,,,,,,,,,,,,,,,8,,,2,4,998,9
1,99,,2,1,"M",1059,,37,17,8,,3,"M",1,2017,"U",,"U","N",,,"I420",227,68,,22,5,1,1,"I219",2,1,"I509",3,1,"I500",3,2,"I420",3,3,"K279",,,,,,,,,,,,,,,,,,,,,,,,,,,,,,,,,,,,,,,,,,,,,,4,"I420","I219","I500","K279",,,,,,,,,,,,,,,,,8,,,2,4,998,9
1,99,,2,1,"M",1085,,43,23,11,,3,"S",1,2017,"U",,"U","N",,,"R99",379,110,,36,1,1,1,"R99",,,,,,,,,,,,,,,,,,,,,,,,,,,,,,,,,,,,,,,,,,,,,,,,,,,,,,,,,,1,"R99",,,,,,,,,,,,,,,,,,,,8,,,2,4,998,9
1,99,,2,1,"M",1067,,39,19,9,,3,"M",2,2017,"U",,"U","N",,,"N185",327,100,,31,4,1,1,"I219",2,1,"N185",2,2,"I64",3,1,"R263",,,,,,,,,,,,,,,,,,,,,,,,,,,,,,,,,,,,,,,,,,,,,,,,,4,"N185","I219","I64","R263",,,,,,,,,,,,,,,,,8,,,2,4,998,9
1,99,,2,1,"F",1075,,41,21,10,,3,"W",3,2017,"U",,"U","N",,,"J459",268,85,,28,1,1,1,"J459",,,,,,,,,,,,,,,,,,,,,,,,,,,,,,,,,,,,,,,,,,,,,,,,,,,,,,,,,,1,"J459",,,,,,,,,,,,,,,,,,,,8,,,2,4,998,9
1,99,,2,1,"M",1020,,30,10,4,,1,"M",4,2017,"Y",1,"U","Y",9,9,"W87",412,123,,39,6,1,1,"I219",2,1,"T140",2,2,"T233",2,3,"T253",3,1,"T754",3,2,"W87",,,,,,,,,,,,,,,,,,,,,,,,,,,,,,,,,,,,,,,,,,,6,"W87","I219","T140","T233","T253","T754",,,,,,,,,,,,,,,8,,,2,4,998,9
1,99,,2,1,"F",1054,,36,16,7,,1,"M",5,2017,"U",,"U","N",,,"J189",257,78,,27,8,1,1,"A419",2,1,"N390",3,1,"J189",6,1,"E872",6,2,"N179",6,3,"N189",6,4,"E149",6,5,"D649",,,,,,,,,,,,,,,,,,,,,,,,,,,,,,,,,,,,,6,"J189","A419","D649","E147","N179","N390",,,,,,,,,,,,,,,8,,,2,4,998,9
1,99,,2,1,"M",5002,,2,1,1,2,1,"S",6,2017,"U",,"U","N",,,"P220",361,108,96,33,3,1,1,"P285",2,1,"P220",3,1,"P072",,,,,,,,,,,,,,,,,,,,,,,,,,,,,,,,,,,,,,,,,,,,,,,,,,,,2,"P220","P285",,,,,,,,,,,,,,,,,,,8,,,2,4,998,9
1,99,,2,1,"M",1022,,30,10,4,,1,"S",1,2017,"Y",1,"U","N",9,9,"W87",412,123,,39,9,1,1,"T149",1,2,"I678",2,1,"M628",2,2,"S370",2,3,"S361",3,1,"J189",3,2,"R579",3,3,"R048",6,1,"W87",,,,,,,,,,,,,,,,,,,,,,,,,,,,,,,,,,9,"W87","I678","J189","M628","R048","R579","S361","S370","T149",,,,,,,,,,,,8,,,2,4,998,9
1,99,,2,1,"M",1070,,40,20,9,,3,"M",3,2017,"U",,"U","N",,,"I219",211,59,,21,2,1,1,"I219",2,1,"F171",,,,,,,,,,,,,,,,,,,,,,,,,,,,,,,,,,,,,,,,,,,,,,,,,,,,,,,2,"I219","F171",,,,,,,,,,,,,,,,,,,8,,,2,4,998,9
1,99,,2,1,"M",1029,,31,11,5,,3,"M",5,2017,"U",,"U","N",,,"R99",379,110,,36,1,1,1,"R99",,,,,,,,,,,,,,,,,,,,,,,,,,,,,,,,,,,,,,,,,,,,,,,,,,,,,,,,,,1,"R99",,,,,,,,,,,,,,,,,,,,8,,,2,4,998,9
1,99,,2,1,"M",1063,,38,18,8,,3,"S",6,2017,"U",,"U","N",,,"D649",152,45,,37,5,1,1,"L899",1,2,"A419",2,1,"I64",2,2,"R263",3,1,"D649",,,,,,,,,,,,,,,,,,,,,,,,,,,,,,,,,,,,,,,,,,,,,,5,"D649","A419","I64","L899","R263",,,,,,,,,,,,,,,,8,,,2,4,998,9
1,99,,2,1,"M",1075,,41,21,10,,1,"M",6,2017,"U",,"U","N",,,"K922",306,111,,37,4,1,1,"A419",1,2,"G060",2,1,"K922",2,2,"J189",,,,,,,,,,,,,,,,,,,,,,,,,,,,,,,,,,,,,,,,,,,,,,,,,4,"K922","A419","G060","J189",,,,,,,,,,,,,,,,,8,,,2,4,998,9
1,99,,2,1,"M",1070,,40,20,9,,3,"D",7,2017,"U",,"U","N",,,"J449",267,86,,28,7,1,1,"I219",2,1,"I48",3,1,"I500",6,1,"L031",6,2,"I279",6,3,"J449",6,4,"I10",,,,,,,,,,,,,,,,,,,,,,,,,,,,,,,,,,,,,,,,7,"J449","I10","I219","I279","I48","I500","L031",,,,,,,,,,,,,,1,,,1,1,998,9
1,99,,2,1,"F",1094,,44,24,11,,3,"W",3,2017,"U",,"U","N",,,"E46",167,48,,37,3,1,1,"A419",1,2,"N390",2,1,"E46",,,,,,,,,,,,,,,,,,,,,,,,,,,,,,,,,,,,,,,,,,,,,,,,,,,,3,"E46","A419","N390",,,,,,,,,,,,,,,,,,8,,,2,4,998,9
1,99,,2,1,"F",1038,,33,13,6,,1,"S",3,2017,"U",,"U","N",,,"E055",158,111,,37,6,1,1,"I509",2,1,"I500",2,2,"I38",3,1,"E055",6,1,"L039",6,2,"I099",,,,,,,,,,,,,,,,,,,,,,,,,,,,,,,,,,,,,,,,,,,4,"E055","I099","I500","L039",,,,,,,,,,,,,,,,,8,,,2,4,998,9
1,99,,2,2,"M",1083,,42,22,10,,3,"M",4,2017,"U",,"U","N",,,"E149",159,46,,16,4,1,1,"I219",2,1,"E149",3,1,"I10",6,1,"C61",,,,,,,,,,,,,,,,,,,,,,,,,,,,,,,,,,,,,,,,,,,,,,,,,4,"E149","C61","I10","I219",,,,,,,,,,,,,,,,,8,,,2,4,998,9
1,99,,2,2,"M",1089,,43,23,11,,3,"M",6,2017,"U",,"U","N",,,"C61",113,33,,11,4,1,1,"C61",2,1,"R263",3,1,"R54",6,1,"N189",,,,,,,,,,,,,,,,,,,,,,,,,,,,,,,,,,,,,,,,,,,,,,,,,4,"C61","N189","R263","R54",,,,,,,,,,,,,,,,,8,,,2,4,998,9
1,99,,2,2,"F",1034,,32,12,5,,1,"M",2,2017,"U",,"U","N",,,"E119",159,46,,16,5,1,1,"A419",2,1,"E870",2,2,"R739",3,1,"E119",3,2,"D696",,,,,,,,,,,,,,,,,,,,,,,,,,,,,,,,,,,,,,,,,,,,,,5,"E119","A419","D696","E870","R739",,,,,,,,,,,,,,,,8,,,2,4,998,9
1,99,,2,2,"M",1017,,29,9,4,,3,"S",4,2017,"N",2,"U","N",9,9,"X70",428,126,,40,3,1,1,"T71",1,2,"X70",2,1,"T71",,,,,,,,,,,,,,,,,,,,,,,,,,,,,,,,,,,,,,,,,,,,,,,,,,,,2,"X70","T71",,,,,,,,,,,,,,,,,,,8,,,2,4,998,9
1,99,,2,2,"M",1035,,33,13,6,,3,"M",4,2017,"Y",2,"U","Y",9,9,"X84",431,126,,40,5,1,1,"T149",2,1,"S153",6,1,"K811",6,2,"K802",6,3,"X84",,,,,,,,,,,,,,,,,,,,,,,,,,,,,,,,,,,,,,,,,,,,,,4,"X84","K801","S153","T149",,,,,,,,,,,,,,,,,1,,,1,1,998,9
1,99,,2,2,"F",1087,,43,23,11,,1,"W",4,2017,"U",,"U","N",,,"A419",23,10,,37,9,1,1,"R579",1,2,"N179",2,1,"A419",2,2,"I249",6,1,"I10",6,2,"M199",6,3,"R263",6,4,"R13",6,5,"F03",,,,,,,,,,,,,,,,,,,,,,,,,,,,,,,,,,9,"A419","F03","I10","I249","M199","N179","R13","R263","R579",,,,,,,,,,,,8,,,2,4,998,9
1,99,,2,2,"M",1072,,40,20,9,,2,"M",3,2017,"U",,"U","N",,,"I714",242,73,,26,2,1,1,"I714",2,1,"I714",,,,,,,,,,,,,,,,,,,,,,,,,,,,,,,,,,,,,,,,,,,,,,,,,,,,,,,1,"I714",,,,,,,,,,,,,,,,,,,,8,,,2,4,998,9
1,99,,2,2,"F",1075,,41,21,10,,3,"W",4,2017,"U",,"U","N",,,"E145",159,46,,16,5,1,1,"A419",2,1,"L984",3,1,"E149",3,2,"I10",3,3,"R263",,,,,,,,,,,,,,,,,,,,,,,,,,,,,,,,,,,,,,,,,,,,,,4,"E145","A419","I10","R263",,,,,,,,,,,,,,,,,8,,,2,4,998,9
1,99,,2,2,"M",1017,,29,9,4,,3,"S",5,2017,"N",2,"U","N",9,9,"X70",428,126,,40,2,1,1,"T71",1,2,"X70",,,,,,,,,,,,,,,,,,,,,,,,,,,,,,,,,,,,,,,,,,,,,,,,,,,,,,,2,"X70","T71",,,,,,,,,,,,,,,,,,,8,,,2,4,998,9
1,99,,2,2,"M",1043,,34,14,6,,3,"D",7,2017,"U",,"U","N",,,"I219",211,59,,21,1,1,1,"I219",,,,,,,,,,,,,,,,,,,,,,,,,,,,,,,,,,,,,,,,,,,,,,,,,,,,,,,,,,1,"I219",,,,,,,,,,,,,,,,,,,,8,,,2,4,998,9
1,99,,2,2,"M",1056,,37,17,8,,3,"M",1,2017,"U",,"U","N",,,"I219",211,59,,21,1,1,1,"I219",,,,,,,,,,,,,,,,,,,,,,,,,,,,,,,,,,,,,,,,,,,,,,,,,,,,,,,,,,1,"I219",,,,,,,,,,,,,,,,,,,,8,,,2,4,998,9
1,99,,2,2,"M",1066,,39,19,9,,1,"M",2,2017,"U",,"U","N",,,"E112",159,46,,16,6,1,1,"A419",2,1,"K650",3,1,"E119",4,1,"N185",4,2,"I500",6,1,"I420",,,,,,,,,,,,,,,,,,,,,,,,,,,,,,,,,,,,,,,,,,,5,"E112","A419","I420","I500","K650",,,,,,,,,,,,,,,,8,,,2,4,998,9
1,99,,2,2,"M",1077,,41,21,10,,1,"M",2,2017,"U",,"U","N",,,"C189",81,23,,6,7,1,1,"D689",2,1,"D696",2,2,"D619",3,1,"E149",4,1,"C189",6,1,"I259",6,2,"I10",,,,,,,,,,,,,,,,,,,,,,,,,,,,,,,,,,,,,,,,7,"C189","D619","D689","D696","E149","I10","I259",,,,,,,,,,,,,,1,,,1,1,998,9
1,99,,2,2,"M",1066,,39,19,9,,3,"M",3,2017,"U",,"U","N",,,"I219",211,59,,21,5,1,1,"I219",2,1,"I499",3,1,"I48",6,1,"J449",6,2,"I500",,,,,,,,,,,,,,,,,,,,,,,,,,,,,,,,,,,,,,,,,,,,,,4,"I219","I48","I500","J449",,,,,,,,,,,,,,,,,8,,,2,4,998,9
1,99,,2,2,"F",1064,,38,18,8,,1,"W",5,2017,"U",,"U","N",,,"C541",108,31,,10,4,1,1,"C541",1,2,"C80",6,1,"D649",6,2,"N939",,,,,,,,,,,,,,,,,,,,,,,,,,,,,,,,,,,,,,,,,,,,,,,,,3,"C541","D649","N939",,,,,,,,,,,,,,,,,,8,,,2,4,998,9
1,99,,2,2,"M",1079,,41,21,10,,1,"M",6,2017,"U",,"U","N",,,"G309",189,52,,17,5,1,1,"J690",2,1,"G309",2,2,"R13",2,3,"K590",2,4,"R33",,,,,,,,,,,,,,,,,,,,,,,,,,,,,,,,,,,,,,,,,,,,,,5,"G309","J690","K590","R13","R33",,,,,,,,,,,,,,,,8,,,2,4,998,9
1,99,,2,2,"M",1057,,37,17,8,,3,"S",2,2017,"U",,"U","N",,9,"I110",207,56,,20,8,1,1,"I500",2,1,"I10",3,1,"K769",3,2,"K746",3,3,"D696",3,4,"R263",4,1,"S720",6,1,"X590",,,,,,,,,,,,,,,,,,,,,,,,,,,,,,,,,,,,,8,"I110","D696","I10","I500","K746","R263","S720","X590",,,,,,,,,,,,,8,,,2,4,998,9
1,99,,2,2,"F",4027,,11,1,1,11,1,"S",3,2017,"U",,"U","N",,,"P548",364,108,110,33,3,1,1,"P548",2,1,"P072",6,1,"P021",,,,,,,,,,,,,,,,,,,,,,,,,,,,,,,,,,,,,,,,,,,,,,,,,,,,2,"P548","P021",,,,,,,,,,,,,,,,,,,8,,,2,4,998,9
1,99,,2,3,"F",1077,,41,21,10,,2,"W",4,2017,"U",1,"U","N",9,,"V892",397,114,,38,2,1,1,"T148",1,2,"V892",,,,,,,,,,,,,,,,,,,,,,,,,,,,,,,,,,,,,,,,,,,,,,,,,,,,,,,2,"V892","T148",,,,,,,,,,,,,,,,,,,8,,,2,4,998,9
1,99,,2,3,"M",1053,,36,16,7,,1,"W",5,2017,"U",,"U","N",,,"L029",308,111,,37,4,1,1,"A419",2,1,"A490",3,1,"L029",6,1,"J80",,,,,,,,,,,,,,,,,,,,,,,,,,,,,,,,,,,,,,,,,,,,,,,,,4,"L029","A419","A490","J80",,,,,,,,,,,,,,,,,8,,,2,4,998,9
1,99,,2,3,"M",1082,,42,22,10,,1,"M",5,2017,"U",,"U","N",,,"C64",117,34,,12,5,1,1,"C64",2,1,"J988",3,1,"R64",6,1,"I313",6,2,"C64",,,,,,,,,,,,,,,,,,,,,,,,,,,,,,,,,,,,,,,,,,,,,,4,"C64","I313","J988","R64",,,,,,,,,,,,,,,,,8,,,2,4,998,9
1,99,,2,3,"M",1070,,40,20,9,,1,"M",6,2017,"U",,"U","N",,,"I219",211,59,,21,1,1,1,"I219",,,,,,,,,,,,,,,,,,,,,,,,,,,,,,,,,,,,,,,,,,,,,,,,,,,,,,,,,,1,"I219",,,,,,,,,,,,,,,,,,,,8,,,2,4,998,9
1,99,,2,3,"F",1050,,36,16,7,,1,"S",1,2017,"U",,"U","N",,,"A415",23,10,,37,7,1,1,"A415",1,2,"A403",3,1,"A498",3,2,"I10",6,1,"E149",6,2,"A498",6,3,"N189",,,,,,,,,,,,,,,,,,,,,,,,,,,,,,,,,,,,,,,,5,"A415","A403","A498","E149","I120",,,,,,,,,,,,,,,,8,,,2,4,998,9
1,99,,2,3,"M",1074,,40,20,9,,1,"W",1,2017,"U",,"U","N",,,"I629",236,70,,24,6,1,1,"I629",2,1,"J189",3,1,"I500",3,2,"I509",3,3,"I48",3,4,"E669",,,,,,,,,,,,,,,,,,,,,,,,,,,,,,,,,,,,,,,,,,,5,"I629","E669","I48","I500","J189",,,,,,,,,,,,,,,,8,,,2,4,998,9
1,99,,2,3,"F",1061,,38,18,8,,3,"M",3,2017,"U",,"U","N",,,"I48",228,68,,22,6,1,1,"I500",2,1,"N185",3,1,"I48",3,2,"E149",3,3,"I10",3,4,"E669",,,,,,,,,,,,,,,,,,,,,,,,,,,,,,,,,,,,,,,,,,,5,"I48","E142","E669","I10","I500",,,,,,,,,,,,,,,,8,,,2,4,998,9
1,99,,2,3,"M",1076,,41,21,10,,1,"M",6,2017,"U",,"U","N",,,"K559",293,111,,37,3,1,1,"A419",2,1,"J189",3,1,"K559",,,,,,,,,,,,,,,,,,,,,,,,,,,,,,,,,,,,,,,,,,,,,,,,,,,,3,"K559","A419","J189",,,,,,,,,,,,,,,,,,8,,,2,4,998,9
1,99,,2,3,"M",1074,,40,20,9,,1,"M",3,2017,"U",,"U","N",,,"K746",300,95,,30,6,1,1,"K729",2,1,"K746",3,1,"N185",6,1,"E119",6,2,"I10",6,3,"I251",,,,,,,,,,,,,,,,,,,,,,,,,,,,,,,,,,,,,,,,,,,5,"K746","E112","I10","I251","K729",,,,,,,,,,,,,,,,8,,2,2,4,998,9
1,99,,2,3,"M",5002,,2,1,1,2,1,"S",5,2017,"U",,"U","N",,,"Q249",369,109,123,34,4,1,1,"P219",1,2,"P209",2,1,"Q249",6,1,"P012",,,,,,,,,,,,,,,,,,,,,,,,,,,,,,,,,,,,,,,,,,,,,,,,,4,"Q249","P012","P209","P219",,,,,,,,,,,,,,,,,8,,,2,4,998,9
1,99,,2,3,"M",1046,,35,15,7,,1,"M",6,2017,"U",,"U","N",,,"I259",215,63,,21,7,1,1,"I471",2,1,"I420",3,1,"I259",6,1,"E149",6,2,"I10",6,3,"I48",6,4,"E668",,,,,,,,,,,,,,,,,,,,,,,,,,,,,,,,,,,,,,,,7,"I259","E149","E668","I10","I420","I471","I48",,,,,,,,,,,,,,8,,,2,4,998,9
1,99,,2,3,"M",1076,,41,21,10,,1,"M",7,2017,"U",,"U","N",,,"C182",81,23,,6,4,1,1,"C182",6,1,"J449",6,2,"I10",6,3,"R568",,,,,,,,,,,,,,,,,,,,,,,,,,,,,,,,,,,,,,,,,,,,,,,,,4,"C182","I10","J449","R568",,,,,,,,,,,,,,,,,8,,,2,4,998,9
1,99,,2,3,"M",1054,,36,16,7,,1,"S",7,2017,"U",,"U","N",,,"I219",211,59,,21,3,1,1,"I248",2,1,"I219",3,1,"I259",,,,,,,,,,,,,,,,,,,,,,,,,,,,,,,,,,,,,,,,,,,,,,,,,,,,3,"I219","I248","I259",,,,,,,,,,,,,,,,,,8,,,2,4,998,9
1,99,,2,3,"F",1089,,43,23,11,,3,"W",1,2017,"U",,"U","N",,,"J449",267,86,,28,3,1,1,"I499",2,1,"J449",6,1,"F179",,,,,,,,,,,,,,,,,,,,,,,,,,,,,,,,,,,,,,,,,,,,,,,,,,,,3,"J449","F179","I499",,,,,,,,,,,,,,,,,,8,,,2,4,998,9
1,99,,2,3,"M",1048,,35,15,7,,1,"S",1,2017,"U",,"U","N",,,"N185",327,100,,31,7,1,1,"A419",2,1,"L031",3,1,"N185",3,2,"Y841",6,1,"E668",6,2,"G473",6,3,"I500",,,,,,,,,,,,,,,,,,,,,,,,,,,,,,,,,,,,,,,,7,"N185","A419","E668","G473","I500","L031","Y841",,,,,,,,,,,,,,8,,,2,4,998,9
1,99,,2,3,"F",1061,,38,18,8,,3,"S",3,2017,"U",,"U","N",,,"N185",327,100,,31,2,1,1,"A419",3,1,"N185",,,,,,,,,,,,,,,,,,,,,,,,,,,,,,,,,,,,,,,,,,,,,,,,,,,,,,,2,"N185","A419",,,,,,,,,,,,,,,,,,,8,,,2,4,998,9
1,99,,2,3,"F",1071,,40,20,9,,3,"W",5,2017,"U",,"U","N",,,"C509",104,29,,9,2,1,1,"C509",1,2,"C795",,,,,,,,,,,,,,,,,,,,,,,,,,,,,,,,,,,,,,,,,,,,,,,,,,,,,,,2,"C509","C795",,,,,,,,,,,,,,,,,,,8,,,2,4,998,9
1,99,,2,3,"F",1053,,36,16,7,,1,"D",6,2017,"U",,"U","N",,,"A071",10,3,,37,10,1,1,"J969",1,2,"R579",2,1,"A071",2,2,"E86",3,1,"I959",3,2,"N185",3,3,"R730",3,4,"E149",3,5,"I500",3,6,"K746",,,,,,,,,,,,,,,,,,,,,,,,,,,,,,,9,"A071","E142","E86","I500","I959","J969","K746","R579","R730",,,,,,,,,,,,8,,,2,4,998,9
1,99,,2,3,"M",1071,,40,20,9,,1,"M",6,2017,"U",,"U","N",,,"E149",159,46,,16,6,1,1,"J80",2,1,"J189",3,1,"E149",3,2,"I10",3,3,"I251",3,4,"I64",,,,,,,,,,,,,,,,,,,,,,,,,,,,,,,,,,,,,,,,,,,6,"E149","I10","I251","I64","J189","J80",,,,,,,,,,,,,,,8,,,2,4,998,9
1,99,,2,3,"M",1077,,41,21,10,,1,"M",6,2017,"U",,"U","N",,,"C61",113,33,,11,7,1,1,"I620",2,1,"C61",2,2,"C80",2,3,"J969",3,1,"K922",3,2,"R579",6,1,"E149",,,,,,,,,,,,,,,,,,,,,,,,,,,,,,,,,,,,,,,,6,"C61","E149","I620","J969","K922","R579",,,,,,,,,,,,,,,8,,2,2,4,998,9
1,99,,2,3,"M",1061,,38,18,8,,3,"S",1,2017,"U",,"U","N",,,"E149",159,46,,16,3,1,1,"I499",2,1,"E149",6,1,"F102",,,,,,,,,,,,,,,,,,,,,,,,,,,,,,,,,,,,,,,,,,,,,,,,,,,,3,"E149","F102","I499",,,,,,,,,,,,,,,,,,8,,,2,4,998,9
1,99,,2,3,"F",1065,,39,19,9,,1,"W",3,2017,"U",,"U","N",,,"I48",228,68,,22,5,1,1,"A419",2,1,"N390",2,2,"N185",2,3,"E119",3,1,"I48",,,,,,,,,,,,,,,,,,,,,,,,,,,,,,,,,,,,,,,,,,,,,,4,"I48","A419","E112","N390",,,,,,,,,,,,,,,,,8,,,2,4,998,9
1,99,,2,3,"F",2001,,12,2,1,12,1,"S",4,2017,"U",,"U","N",,,"Q249",369,109,123,34,1,1,1,"Q249",,,,,,,,,,,,,,,,,,,,,,,,,,,,,,,,,,,,,,,,,,,,,,,,,,,,,,,,,,1,"Q249",,,,,,,,,,,,,,,,,,,,8,,,2,4,998,9
1,99,,2,3,"F",1072,,40,20,9,,3,"W",6,2017,"U",,"U","N",,,"E149",159,46,,16,8,1,1,"R092",2,1,"I219",3,1,"E149",3,2,"I10",3,3,"E785",6,1,"I64",6,2,"G819",6,3,"R263",,,,,,,,,,,,,,,,,,,,,,,,,,,,,,,,,,,,,8,"E149","E785","G819","I10","I219","I64","R092","R263",,,,,,,,,,,,,8,,,2,4,998,9
1,99,,2,4,"F",1076,,41,21,10,,1,"W",1,2017,"U",,"U","N",,,"C80",125,43,,15,4,1,1,"C80",6,1,"I251",6,2,"I10",6,3,"J189",,,,,,,,,,,,,,,,,,,,,,,,,,,,,,,,,,,,,,,,,,,,,,,,,4,"C80","I10","I251","J189",,,,,,,,,,,,,,,,,8,,,2,4,998,9
1,99,,2,4,"M",1058,,37,17,8,,3,"M",1,2017,"U",,"U","N",,,"C61",113,33,,11,3,1,1,"N390",2,1,"C61",2,2,"C80",,,,,,,,,,,,,,,,,,,,,,,,,,,,,,,,,,,,,,,,,,,,,,,,,,,,2,"C61","N390",,,,,,,,,,,,,,,,,,,8,,,2,4,998,9
1,99,,2,4,"F",1088,,43,23,11,,1,"W",3,2017,"U",,"U","N",,,"A419",23,10,,37,4,1,1,"A419",2,1,"J969",2,2,"A498",6,1,"R263",,,,,,,,,,,,,,,,,,,,,,,,,,,,,,,,,,,,,,,,,,,,,,,,,4,"A419","A498","J969","R263",,,,,,,,,,,,,,,,,8,,,2,4,998,9
1,99,,2,4,"F",1068,,39,19,9,,1,"M",5,2017,"U",,"U","N",,,"L031",308,111,,37,6,1,1,"A419",2,1,"A419",3,1,"L031",6,1,"I500",6,2,"E119",6,3,"I10",,,,,,,,,,,,,,,,,,,,,,,,,,,,,,,,,,,,,,,,,,,5,"L031","A419","E119","I10","I500",,,,,,,,,,,,,,,,8,,,2,4,998,9
1,99,,2,4,"F",1091,,44,24,11,,3,"S",1,2017,"U",,"U","N",,,"J189",257,78,,27,1,2,1,"J189",,,,,,,,,,,,,,,,,,,,,,,,,,,,,,,,,,,,,,,,,,,,,,,,,,,,,,,,,,1,"J189",,,,,,,,,,,,,,,,,,,,8,,,2,4,998,9
1,99,,2,4,"F",1081,,42,22,10,,1,"W",1,2017,"U",,"U","N",,,"E142",159,46,,16,6,1,1,"N19",1,2,"G934",2,1,"N185",6,1,"B99",6,2,"E149",6,3,"E875",,,,,,,,,,,,,,,,,,,,,,,,,,,,,,,,,,,,,,,,,,,5,"E142","B99","E875","G934","N185",,,,,,,,,,,,,,,,8,,,2,4,998,9
1,99,,2,4,"F",1081,,42,22,10,,1,"M",3,2017,"U",,"U","N",,,"I420",227,68,,22,5,1,1,"I499",2,1,"I420",6,1,"I10",6,2,"I48",6,3,"I64",,,,,,,,,,,,,,,,,,,,,,,,,,,,,,,,,,,,,,,,,,,,,,4,"I420","I10","I48","I64",,,,,,,,,,,,,,,,,8,,,2,4,998,9
1,99,,2,4,"M",1079,,41,21,10,,1,"W",5,2017,"U",,"U","N",,,"A419",23,10,,37,6,1,1,"J81",1,2,"J189",2,1,"N19",3,1,"A419",6,1,"K922",6,2,"E878",,,,,,,,,,,,,,,,,,,,,,,,,,,,,,,,,,,,,,,,,,,6,"A419","E878","J189","J81","K922","N19",,,,,,,,,,,,,,,8,,,2,4,998,9
1,99,,2,4,"M",1013,,28,8,3,,1,"S",6,2017,"U",,"U","N",,,"C80",125,43,,15,6,1,1,"I319",2,1,"C80",2,2,"D899",6,1,"A419",6,2,"A167",6,3,"A188",,,,,,,,,,,,,,,,,,,,,,,,,,,,,,,,,,,,,,,,,,,6,"C80","A167","A188","A419","D899","I319",,,,,,,,,,,,,,,8,,,2,4,998,9
1,99,,2,4,"M",1069,,39,19,9,,2,"W",6,2017,"U",,"U","N",,,"C259",88,25,,7,2,1,1,"I469",2,1,"C259",,,,,,,,,,,,,,,,,,,,,,,,,,,,,,,,,,,,,,,,,,,,,,,,,,,,,,,2,"C259","I469",,,,,,,,,,,,,,,,,,,8,,,2,4,998,9
1,99,,2,4,"M",1078,,41,21,10,,1,"M",4,2017,"U",,"U","N",,,"J441",267,86,,28,3,1,1,"J969",1,2,"J449",1,3,"J441",,,,,,,,,,,,,,,,,,,,,,,,,,,,,,,,,,,,,,,,,,,,,,,,,,,,2,"J441","J969",,,,,,,,,,,,,,,,,,,8,,,2,4,998,9
1,99,,2,4,"M",1077,,41,21,10,,1,"W",6,2017,"U",,"U","N",,,"C349",93,27,,8,4,1,1,"C349",2,1,"J189",3,1,"N40",6,1,"I10",,,,,,,,,,,,,,,,,,,,,,,,,,,,,,,,,,,,,,,,,,,,,,,,,4,"C349","I10","J189","N40",,,,,,,,,,,,,,,,,8,,,2,4,998,9
1,99,,2,4,"F",1068,,39,19,9,,1,"W",6,2017,"U",,"U","N",,,"I120",208,69,,23,6,1,1,"A419",1,2,"L089",2,1,"N185",2,2,"I500",2,3,"I48",6,1,"I10",,,,,,,,,,,,,,,,,,,,,,,,,,,,,,,,,,,,,,,,,,,5,"I120","A419","I48","I500","L089",,,,,,,,,,,,,,,,8,,,2,4,998,9
1,99,,2,4,"M",1058,,37,17,8,,1,"M",7,2017,"U",,"U","N",,,"I639",237,70,,24,5,1,1,"G935",2,1,"I639",3,1,"I10",6,1,"I500",6,2,"M109",,,,,,,,,,,,,,,,,,,,,,,,,,,,,,,,,,,,,,,,,,,,,,5,"I639","G935","I10","I500","M109",,,,,,,,,,,,,,,,8,,,2,4,998,9
1,99,,2,4,"F",1078,,41,21,10,,3,"W",7,2017,"U",,"U","N",,,"E149",159,46,,16,4,1,1,"A419",2,1,"L899",3,1,"I10",4,1,"E149",,,,,,,,,,,,,,,,,,,,,,,,,,,,,,,,,,,,,,,,,,,,,,,,,4,"E149","A419","I10","L899",,,,,,,,,,,,,,,,,8,,,2,4,998,9
1,99,,2,4,"M",1065,,39,19,9,,3,"M",6,2017,"U",,"U","N",,,"M109",313,111,,37,2,1,1,"I219",3,1,"M109",,,,,,,,,,,,,,,,,,,,,,,,,,,,,,,,,,,,,,,,,,,,,,,,,,,,,,,2,"M109","I219",,,,,,,,,,,,,,,,,,,8,,,2,4,998,9
1,99,,2,4,"M",1063,,38,18,8,,3,"M",1,2017,"U",,"U","N",,,"I219",211,59,,21,1,1,1,"I219",,,,,,,,,,,,,,,,,,,,,,,,,,,,,,,,,,,,,,,,,,,,,,,,,,,,,,,,,,1,"I219",,,,,,,,,,,,,,,,,,,,8,,,2,4,998,9
1,99,,2,4,"M",1065,,39,19,9,,2,"M",1,2017,"U",,"U","N",,,"I64",238,70,,24,7,1,1,"A419",2,1,"L899",6,1,"E149",6,2,"R263",6,3,"N19",6,4,"I10",6,5,"I64",,,,,,,,,,,,,,,,,,,,,,,,,,,,,,,,,,,,,,,,6,"I64","A419","E142","I10","L899","R263",,,,,,,,,,,,,,,8,,,2,4,998,9
1,99,,2,5,"M",1060,,38,18,8,,1,"M",3,2017,"U",,"U","N",,,"I500",230,67,,22,7,1,1,"J80",2,1,"J189",3,1,"I500",3,2,"I509",6,1,"E149",6,2,"I10",6,3,"N189",,,,,,,,,,,,,,,,,,,,,,,,,,,,,,,,,,,,,,,,5,"I500","E142","I10","J189","J80",,,,,,,,,,,,,,,,8,,,2,4,998,9
1,99,,2,5,"M",1075,,41,21,10,,1,"S",4,2017,"U",,"U","N",,,"E878",172,111,,37,4,1,1,"J189",2,1,"K567",3,1,"E878",6,1,"E46",,,,,,,,,,,,,,,,,,,,,,,,,,,,,,,,,,,,,,,,,,,,,,,,,4,"E878","E46","J189","K567",,,,,,,,,,,,,,,,,8,,,2,4,998,9
1,99,,2,5,"M",1021,,30,10,4,,3,"S",5,2017,"U",,"U","N",,,"Q934",374,109,,34,1,6,1,"Q934",,,,,,,,,,,,,,,,,,,,,,,,,,,,,,,,,,,,,,,,,,,,,,,,,,,,,,,,,,1,"Q934",,,,,,,,,,,,,,,,,,,,8,,,2,4,998,9
1,99,,2,5,"F",1073,,40,20,9,,3,"M",5,2017,"U",,"U","N",,,"I500",230,67,,22,1,1,1,"I500",,,,,,,,,,,,,,,,,,,,,,,,,,,,,,,,,,,,,,,,,,,,,,,,,,,,,,,,,,1,"I500",,,,,,,,,,,,,,,,,,,,8,,,2,4,998,9
1,99,,2,5,"M",1017,,29,9,4,,1,"S",7,2017,"U",,"U","N",,,"A90",41,18,,37,3,1,1,"R048",2,1,"A90",3,1,"D696",,,,,,,,,,,,,,,,,,,,,,,,,,,,,,,,,,,,,,,,,,,,,,,,,,,,3,"A90","D696","R048",,,,,,,,,,,,,,,,,,8,,,2,4,998,9
1,99,,2,5,"M",1081,,42,22,10,,1,"M",7,2017,"U",,"U","N",,,"L984",309,111,,37,5,1,1,"A419",2,1,"L984",6,1,"K922",6,2,"E46",6,3,"R263",,,,,,,,,,,,,,,,,,,,,,,,,,,,,,,,,,,,,,,,,,,,,,5,"L984","A419","E46","K922","R263",,,,,,,,,,,,,,,,8,,,2,4,998,9
1,99,,2,5,"M",1070,,40,20,9,,3,"M",3,2017,"U",,"U","N",,,"E142",159,46,,16,5,1,1,"I219",3,1,"E149",3,2,"I10",3,3,"N189",3,4,"E785",,,,,,,,,,,,,,,,,,,,,,,,,,,,,,,,,,,,,,,,,,,,,,4,"E142","E785","I10","I219",,,,,,,,,,,,,,,,,8,,,2,4,998,9
1,99,,2,5,"M",1063,,38,18,8,,1,"M",5,2017,"U",,"U","N",,,"E112",159,46,,16,7,1,1,"N19",1,2,"G934",2,1,"N185",3,1,"E119",6,1,"I10",6,2,"M889",6,3,"D649",,,,,,,,,,,,,,,,,,,,,,,,,,,,,,,,,,,,,,,,6,"E112","D649","G934","I10","M889","N185",,,,,,,,,,,,,,,8,,,2,4,998,9
1,99,,2,5,"M",1031,,32,12,5,,2,"M",6,2017,"U",,"U","N",,,"L031",308,111,,37,3,1,1,"A419",2,1,"A419",3,1,"L031",,,,,,,,,,,,,,,,,,,,,,,,,,,,,,,,,,,,,,,,,,,,,,,,,,,,2,"L031","A419",,,,,,,,,,,,,,,,,,,8,,,2,4,998,9
1,99,,2,5,"F",1070,,40,20,9,,1,"W",6,2017,"U",,"U","N",,,"I219",211,59,,21,4,1,1,"I499",1,2,"I472",1,3,"R570",2,1,"I219",,,,,,,,,,,,,,,,,,,,,,,,,,,,,,,,,,,,,,,,,,,,,,,,,3,"I219","I472","R570",,,,,,,,,,,,,,,,,,8,,,2,4,998,9
1,99,,2,5,"M",1071,,40,20,9,,1,"W",7,2017,"U",,"U","N",,,"E149",159,46,,16,5,1,1,"R570",2,1,"I219",3,1,"E149",3,2,"I10",6,1,"J189",,,,,,,,,,,,,,,,,,,,,,,,,,,,,,,,,,,,,,,,,,,,,,5,"E149","I10","I219","J189","R570",,,,,,,,,,,,,,,,8,,,2,4,998,9
1,99,,2,5,"M",1083,,42,22,10,,3,"W",1,2017,"U",,"U","N",,,"C259",88,25,,7,1,1,1,"C259",,,,,,,,,,,,,,,,,,,,,,,,,,,,,,,,,,,,,,,,,,,,,,,,,,,,,,,,,,1,"C259",,,,,,,,,,,,,,,,,,,,8,,,2,4,998,9
1,99,,2,5,"M",1051,,36,16,7,,3,"W",3,2017,"U",,"U","N",,,"I64",238,70,,24,5,1,1,"I64",2,1,"I10",6,1,"I500",6,2,"E785",6,3,"E790",,,,,,,,,,,,,,,,,,,,,,,,,,,,,,,,,,,,,,,,,,,,,,5,"I64","E785","E790","I10","I500",,,,,,,,,,,,,,,,8,,,2,4,998,9