"restatus","educ1989","educ2003","educflag","monthdth","sex","age","ageflag","ager52","ager27","ager12","ager22","placdth","marstat","weekday","year","injwork","mandeath","methdisp","autopsy","activity","injury","ucod","ucr358","ucr113","ucr130","ucr39","eanum","econdp_1","econds_1","enicon_1","econdp_2","econds_2","enicon_2","econdp_3","econds_3","enicon_3","econdp_4","econds_4","enicon_4","econdp_5","econds_5","enicon_5","econdp_6","econds_6","enicon_6","econdp_7","econds_7","enicon_7","econdp_8","econds_8","enicon_8","econdp_9","econds_9","enicon_9","econdp_10","econds_10","enicon_10","econdp_11","econds_11","enicon_11","econdp_12","econds_12","enicon_12","econdp_13","econds_13","enicon_13","econdp_14","econds_14","enicon_14","econdp_15","econds_15","enicon_15","econdp_16","econds_16","enicon_16","econdp_17","econds_17","enicon_17","econdp_18","econds_18","enicon_18","econdp_19","econds_19","enicon_19","econdp_20","econds_20","enicon_20","ranum","record_1","record_2","record_3","record_4","record_5","record_6","record_7","record_8","record_9","record_10","record_11","record_12","record_13","record_14","record_15","record_16","record_17","record_18","record_19","record_20","race","brace","raceimp","racer3","racer5","hispanic","hspanicr"
1,99,,2,1,"M",1054,,36,16,7,,1,"W",6,2016,"U",,"U","N",,,"I619",236,70,,24,2,1,1,"I619",2,1,"I10",,,,,,,,,,,,,,,,,,,,,,,,,,,,,,,,,,,,,,,,,,,,,,,,,,,,,,,2,"I619","I10",,,,,,,,,,,,,,,,,,,8,,,2,4,998,9
1,99,,2,1,"F",1077,,41,21,10,,3,"W",6,2016,"U",,"U","N",,,"I499",228,68,,22,1,1,1,"I499",,,,,,,,,,,,,,,,,,,,,,,,,,,,,,,,,,,,,,,,,,,,,,,,,,,,,,,,,,1,"I499",,,,,,,,,,,,,,,,,,,,8,,,2,4,998,9
1,99,,2,1,"M",1056,,37,17,8,,3,"M",7,2016,"U",,"U","N",0,9,"W80",410,123,,39,4,1,1,"R090",2,1,"T179",2,2,"W80",3,1,"T179",,,,,,,,,,,,,,,,,,,,,,,,,,,,,,,,,,,,,,,,,,,,,,,,,3,"W80","R090","T179",,,,,,,,,,,,,,,,,,8,,,2,4,998,9
1,99,,2,1,"F",1048,,35,15,7,,1,"S",1,2016,"U",,"U","N",,,"I619",236,70,,24,7,1,1,"I619",2,1,"J690",3,1,"I10",3,2,"N185",6,1,"D649",6,2,"E790",6,3,"E785",,,,,,,,,,,,,,,,,,,,,,,,,,,,,,,,,,,,,,,,6,"I619","D649","E785","E790","I120","J690",,,,,,,,,,,,,,,8,,,2,4,998,9
1,99,,2,1,"F",1054,,36,16,7,,1,"M",2,2016,"U",,"U","N",,,"C541",108,31,,10,3,1,1,"A419",2,1,"K566",3,1,"C541",,,,,,,,,,,,,,,,,,,,,,,,,,,,,,,,,,,,,,,,,,,,,,,,,,,,3,"C541","A419","K566",,,,,,,,,,,,,,,,,,8,,,2,4,998,9
1,99,,2,1,"F",1068,,39,19,9,,1,"W",5,2016,"U",,"U","N",,,"L984",309,111,,37,5,1,1,"D65",2,1,"A419",3,1,"E878",4,1,"R630",5,1,"L984",,,,,,,,,,,,,,,,,,,,,,,,,,,,,,,,,,,,,,,,,,,,,,5,"L984","A419","D65","E878","R630",,,,,,,,,,,,,,,,8,,,2,4,998,9
1,99,,2,1,"F",1069,,39,19,9,,3,"S",1,2016,"U",,"U","N",,,"A419",23,10,,37,4,1,1,"I469",2,1,"I472",3,1,"I959",4,1,"A419",,,,,,,,,,,,,,,,,,,,,,,,,,,,,,,,,,,,,,,,,,,,,,,,,4,"A419","I469","I472","I959",,,,,,,,,,,,,,,,,8,,,2,4,998,9
1,99,,2,1,"F",1087,,43,23,11,,1,"W",2,2016,"U",,"U","N",,,"D649",152,45,,37,3,1,1,"K922",2,1,"D649",6,1,"D696",,,,,,,,,,,,,,,,,,,,,,,,,,,,,,,,,,,,,,,,,,,,,,,,,,,,3,"D649","D696","K922",,,,,,,,,,,,,,,,,,8,,,2,4,998,9
1,99,,2,1,"F",1063,,38,18,8,,1,"W",3,2016,"U",,"U","N",,,"L511",309,111,,37,4,1,1,"L512",2,1,"L511",6,1,"E149",6,2,"N189",,,,,,,,,,,,,,,,,,,,,,,,,,,,,,,,,,,,,,,,,,,,,,,,,3,"L511","E142","L512",,,,,,,,,,,,,,,,,,8,,,2,4,998,9
1,99,,2,1,"M",1071,,40,20,9,,1,"S",4,2016,"U",,"U","N",,,"I500",230,67,,22,4,1,1,"A419",2,1,"L089",3,1,"I500",6,1,"E149",,,,,,,,,,,,,,,,,,,,,,,,,,,,,,,,,,,,,,,,,,,,,,,,,4,"I500","A419","E149","L089",,,,,,,,,,,,,,,,,8,,,2,4,998,9
1,99,,2,1,"M",1075,,41,21,10,,1,"M",3,2016,"U",,"U","N",,,"I711",242,73,,26,9,1,1,"I718",2,1,"I712",3,1,"J22",6,1,"I48",6,2,"I500",6,3,"I10",6,4,"N189",6,5,"E149",6,6,"M109",,,,,,,,,,,,,,,,,,,,,,,,,,,,,,,,,,7,"I711","E149","I120","I48","I500","J22","M109",,,,,,,,,,,,,,8,,,2,4,998,9
1,99,,2,1,"F",1075,,41,21,10,,1,"W",3,2016,"U",,"U","N",,,"E790",173,111,,37,9,1,1,"A419",2,1,"L039",2,2,"N179",2,3,"N189",3,1,"E790",3,2,"I10",6,1,"I500",6,2,"I48",6,3,"I694",,,,,,,,,,,,,,,,,,,,,,,,,,,,,,,,,,8,"E790","A419","I120","I48","I500","I694","L039","N179",,,,,,,,,,,,,8,,,2,4,998,9
1,99,,2,1,"F",1056,,37,17,8,,3,"S",4,2016,"U",,"U","N",,,"G419",191,111,,37,3,1,1,"G931",2,1,"G419",6,1,"G409",,,,,,,,,,,,,,,,,,,,,,,,,,,,,,,,,,,,,,,,,,,,,,,,,,,,3,"G419","G409","G931",,,,,,,,,,,,,,,,,,8,,,2,4,998,9
1,99,,2,1,"M",1066,,39,19,9,,1,"M",5,2016,"U",,"U","N",,,"K769",301,111,,37,3,1,1,"K922",2,1,"I859",3,1,"K769",,,,,,,,,,,,,,,,,,,,,,,,,,,,,,,,,,,,,,,,,,,,,,,,,,,,2,"K769","I850",,,,,,,,,,,,,,,,,,,1,,,1,1,998,9
1,99,,2,1,"F",1061,,38,18,8,,3,"M",7,2016,"U",,"U","N",,,"I219",211,59,,21,4,1,1,"I219",2,1,"I251",3,1,"I10",6,1,"E149",,,,,,,,,,,,,,,,,,,,,,,,,,,,,,,,,,,,,,,,,,,,,,,,,4,"I219","E149","I10","I251",,,,,,,,,,,,,,,,,8,,,2,4,998,9
1,99,,2,1,"M",1055,,37,17,8,,3,"M",1,2016,"U",,"U","N",,,"I219",211,59,,21,2,1,1,"I219",3,1,"I10",,,,,,,,,,,,,,,,,,,,,,,,,,,,,,,,,,,,,,,,,,,,,,,,,,,,,,,2,"I219","I10",,,,,,,,,,,,,,,,,,,8,,,2,4,998,9
1,99,,2,1,"F",1088,,43,23,11,,3,"W",1,2016,"U",,"U","N",,,"C509",104,29,,9,3,1,1,"C80",1,2,"C509",2,1,"I959",,,,,,,,,,,,,,,,,,,,,,,,,,,,,,,,,,,,,,,,,,,,,,,,,,,,2,"C509","I959",,,,,,,,,,,,,,,,,,,8,,,2,4,998,9
1,99,,2,1,"F",1076,,41,21,10,,1,"W",2,2016,"U",,"U","N",,,"C541",108,31,,10,4,1,1,"C80",2,1,"C541",6,1,"I10",6,2,"I499",,,,,,,,,,,,,,,,,,,,,,,,,,,,,,,,,,,,,,,,,,,,,,,,,3,"C541","I10","I499",,,,,,,,,,,,,,,,,,8,,,2,4,998,9
1,99,,2,1,"M",1056,,37,17,8,,3,"M",2,2016,"U",,"U","U",,,"I219",211,59,,21,4,1,1,"I219",3,1,"I259",3,2,"I500",3,3,"I10",,,,,,,,,,,,,,,,,,,,,,,,,,,,,,,,,,,,,,,,,,,,,,,,,4,"I219","I10","I259","I500",,,,,,,,,,,,,,,,,8,,,2,4,998,9
1,99,,2,1,"M",1078,,41,21,10,,1,"M",2,2016,"U",,"U","N",,,"I694",239,70,,24,6,1,1,"J189",2,1,"E86",3,1,"E46",6,1,"I694",6,2,"R263",6,3,"I959",,,,,,,,,,,,,,,,,,,,,,,,,,,,,,,,,,,,,,,,,,,5,"I694","E46","E86","I959","J182",,,,,,,,,,,,,,,,8,,,2,4,998,9
1,99,,2,1,"F",1039,,33,13,6,,3,"S",5,2016,"U",,"U","N",,,"C541",108,31,,10,1,1,1,"C541",,,,,,,,,,,,,,,,,,,,,,,,,,,,,,,,,,,,,,,,,,,,,,,,,,,,,,,,,,1,"C541",,,,,,,,,,,,,,,,,,,,8,,,2,4,998,9
1,99,,2,1,"F",1088,,43,23,11,,3,"W",6,2016,"U",,"U","N",,,"E149",159,46,,16,5,1,1,"I219",2,1,"I519",2,2,"I64",3,1,"E149",6,1,"I10",,,,,,,,,,,,,,,,,,,,,,,,,,,,,,,,,,,,,,,,,,,,,,5,"E149","I10","I219","I519","I64",,,,,,,,,,,,,,,,8,,,2,4,998,9
1,99,,2,1,"F",1082,,42,22,10,,1,"W",7,2016,"U",,"U","N",,,"E059",158,111,,37,7,1,1,"I619",1,2,"G819",2,1,"I10",3,1,"J690",3,2,"A099",3,3,"E059",3,4,"R54",,,,,,,,,,,,,,,,,,,,,,,,,,,,,,,,,,,,,,,,7,"E059","A099","G819","I10","I619","J690","R54",,,,,,,,,,,,,,8,,,2,4,998,9
1,99,,2,1,"M",1044,,34,14,6,,1,"M",1,2016,"U",,"U","N",,,"L031",308,111,,37,6,1,1,"A419",2,1,"A419",3,1,"L031",6,1,"I251",6,2,"N19",6,3,"G473",,,,,,,,,,,,,,,,,,,,,,,,,,,,,,,,,,,,,,,,,,,5,"L031","A419","G473","I251","N19",,,,,,,,,,,,,,,,8,,,2,4,998,9
1,99,,2,2,"F",1067,,39,19,9,,1,"M",2,2016,"U",,"U","N",,,"N185",327,100,,31,3,1,1,"E872",2,1,"J81",3,1,"N185",,,,,,,,,,,,,,,,,,,,,,,,,,,,,,,,,,,,,,,,,,,,,,,,,,,,3,"N185","E872","J81",,,,,,,,,,,,,,,,,,8,,,2,4,998,9
1,99,,2,2,"F",1086,,43,23,11,,1,"W",2,2016,"U",,"U","N",,,"J440",267,86,,28,7,1,1,"A419",2,1,"J189",6,1,"E149",6,2,"I48",6,3,"J449",6,4,"T931",6,5,"Y86",,,,,,,,,,,,,,,,,,,,,,,,,,,,,,,,,,,,,,,,6,"J440","A419","E149","I48","T931","Y86",,,,,,,,,,,,,,,8,,,2,4,998,9
1,99,,2,2,"F",1074,,40,20,9,,2,"W",6,2016,"U",,"U","N",,,"L899",309,111,,37,2,1,1,"A419",2,1,"L899",,,,,,,,,,,,,,,,,,,,,,,,,,,,,,,,,,,,,,,,,,,,,,,,,,,,,,,2,"L899","A419",,,,,,,,,,,,,,,,,,,8,,,2,4,998,9
1,99,,2,2,"F",1078,,41,21,10,,3,"W",6,2016,"U",7,"U","N",,,"I64",238,70,,24,3,2,1,"R54",6,1,"I64",6,2,"I10",,,,,,,,,,,,,,,,,,,,,,,,,,,,,,,,,,,,,,,,,,,,,,,,,,,,3,"I64","I10","R54",,,,,,,,,,,,,,,,,,8,,,2,4,998,9
1,99,,2,2,"M",1079,,41,21,10,,1,"M",7,2016,"U",,"U","N",,,"C349",93,27,,8,3,1,1,"C349",2,1,"J189",6,1,"I714",,,,,,,,,,,,,,,,,,,,,,,,,,,,,,,,,,,,,,,,,,,,,,,,,,,,3,"C349","I714","J189",,,,,,,,,,,,,,,,,,8,,,2,4,998,9
1,99,,2,2,"M",1085,,43,23,11,,3,"M",1,2016,"U",,"U","N",,,"E149",159,46,,16,5,1,1,"I709",2,1,"I259",3,1,"E149",6,1,"I10",6,2,"R54",,,,,,,,,,,,,,,,,,,,,,,,,,,,,,,,,,,,,,,,,,,,,,5,"E149","I10","I259","I709","R54",,,,,,,,,,,,,,,,8,,,2,4,998,9
1,99,,2,2,"M",1071,,40,20,9,,1,"M",2,2016,"U",,"U","N",,,"I500",230,67,,22,2,1,1,"K922",2,1,"I500",,,,,,,,,,,,,,,,,,,,,,,,,,,,,,,,,,,,,,,,,,,,,,,,,,,,,,,2,"I500","K922",,,,,,,,,,,,,,,,,,,8,,,2,4,998,9
1,99,,2,2,"M",1039,,33,13,6,,3,"M",2,2016,"N",1,"U","N",0,9,"W74",409,120,,39,2,1,1,"T751",1,2,"W74",,,,,,,,,,,,,,,,,,,,,,,,,,,,,,,,,,,,,,,,,,,,,,,,,,,,,,,2,"W74","T751",,,,,,,,,,,,,,,,,,,8,,,2,4,998,9
1,99,,2,2,"M",1066,,39,19,9,,3,"D",3,2016,"U",,"U","U",,,"E119",159,46,,16,5,1,1,"A419",1,2,"R688",2,1,"E149",2,2,"A419",6,1,"E119",,,,,,,,,,,,,,,,,,,,,,,,,,,,,,,,,,,,,,,,,,,,,,3,"E119","A419","R688",,,,,,,,,,,,,,,,,,8,,,2,4,998,9
1,99,,2,2,"F",1054,,36,16,7,,1,"M",5,2016,"U",,"U","N",,,"I619",236,70,,24,2,1,1,"I619",2,1,"I10",,,,,,,,,,,,,,,,,,,,,,,,,,,,,,,,,,,,,,,,,,,,,,,,,,,,,,,2,"I619","I10",,,,,,,,,,,,,,,,,,,8,,,2,4,998,9
1,99,,2,2,"M",1069,,39,19,9,,3,"M",5,2016,"U",,"U","N",,,"N185",327,100,,31,3,1,1,"I259",2,1,"I251",3,1,"N185",,,,,,,,,,,,,,,,,,,,,,,,,,,,,,,,,,,,,,,,,,,,,,,,,,,,2,"N185","I251",,,,,,,,,,,,,,,,,,,8,,,2,4,998,9
1,99,,2,2,"F",1083,,42,22,10,,1,"W",5,2016,"U",,"U","N",,,"J189",257,78,,27,6,1,1,"J189",6,1,"N189",6,2,"E149",6,3,"I10",6,4,"I500",6,5,"F319",,,,,,,,,,,,,,,,,,,,,,,,,,,,,,,,,,,,,,,,,,,5,"J189","E142","F319","I10","I500",,,,,,,,,,,,,,,,8,,,2,4,998,9
1,99,,2,2,"F",1049,,35,15,7,,3,"M",7,2016,"U",,"U","N",,,"C509",104,29,,9,1,2,1,"C509",,,,,,,,,,,,,,,,,,,,,,,,,,,,,,,,,,,,,,,,,,,,,,,,,,,,,,,,,,1,"C509",,,,,,,,,,,,,,,,,,,,8,,,2,4,998,9
1,99,,2,2,"M",1079,,41,21,10,,1,"W",1,2016,"U",,"U","N",,,"E119",159,46,,16,5,1,1,"D649",2,1,"K922",3,1,"E119",3,2,"I10",3,3,"I48",,,,,,,,,,,,,,,,,,,,,,,,,,,,,,,,,,,,,,,,,,,,,,5,"E119","D649","I10","I48","K922",,,,,,,,,,,,,,,,8,,,2,4,998,9
1,99,,2,2,"F",1029,,31,11,5,,1,"M",2,2016,"U",2,"U","N",0,9,"X70",428,126,,40,4,1,1,"T71",1,2,"X70",2,1,"G931",6,1,"J690",,,,,,,,,,,,,,,,,,,,,,,,,,,,,,,,,,,,,,,,,,,,,,,,,4,"X70","G931","J690","T71",,,,,,,,,,,,,,,,,8,,,2,4,998,9
1,99,,2,2,"F",1080,,42,22,10,,3,"W",2,2016,"U",,"U","N",,,"K297",288,111,,37,2,1,1,"R198",2,1,"K297",,,,,,,,,,,,,,,,,,,,,,,,,,,,,,,,,,,,,,,,,,,,,,,,,,,,,,,2,"K297","R198",,,,,,,,,,,,,,,,,,,8,,,2,4,998,9
1,99,,2,2,"M",1049,,35,15,7,,1,"S",2,2016,"U",,"U","N",,,"F101",178,111,,37,3,1,1,"I219",2,1,"F101",2,2,"F79",,,,,,,,,,,,,,,,,,,,,,,,,,,,,,,,,,,,,,,,,,,,,,,,,,,,3,"F101","F79","I219",,,,,,,,,,,,,,,,,,8,,,2,4,998,9
1,99,,2,2,"M",1051,,36,16,7,,3,"M",3,2016,"U",,"U","N",,,"E119",159,46,,16,2,1,1,"I219",2,1,"E119",,,,,,,,,,,,,,,,,,,,,,,,,,,,,,,,,,,,,,,,,,,,,,,,,,,,,,,2,"E119","I219",,,,,,,,,,,,,,,,,,,8,,,2,4,998,9
1,99,,2,2,"F",1057,,37,17,8,,3,"M",4,2016,"U",,"U","N",,,"I219",211,59,,21,4,1,1,"I248",2,1,"I219",3,1,"I259",6,1,"E668",,,,,,,,,,,,,,,,,,,,,,,,,,,,,,,,,,,,,,,,,,,,,,,,,4,"I219","E668","I248","I259",,,,,,,,,,,,,,,,,8,,,2,4,998,9
1,99,,2,2,"F",1078,,41,21,10,,3,"W",4,2016,"U",,"U","N",,,"I219",211,59,,21,4,1,1,"I219",2,1,"I500",3,1,"I10",6,1,"E785",,,,,,,,,,,,,,,,,,,,,,,,,,,,,,,,,,,,,,,,,,,,,,,,,4,"I219","E785","I10","I500",,,,,,,,,,,,,,,,,8,,,2,4,998,9
1,99,,2,2,"M",1048,,35,15,7,,1,"M",5,2016,"U",,"U","N",,,"E119",159,46,,16,6,1,1,"A419",2,1,"L033",3,1,"E119",6,1,"N179",6,2,"I500",6,3,"E668",,,,,,,,,,,,,,,,,,,,,,,,,,,,,,,,,,,,,,,,,,,6,"E119","A419","E668","I500","L033","N179",,,,,,,,,,,,,,,8,,,2,4,998,9
1,99,,2,2,"M",1064,,38,18,8,,1,"M",5,2016,"U",,"U","N",,,"I619",236,70,,24,3,1,1,"I619",2,1,"I10",6,1,"N189",,,,,,,,,,,,,,,,,,,,,,,,,,,,,,,,,,,,,,,,,,,,,,,,,,,,2,"I619","I120",,,,,,,,,,,,,,,,,,,8,,,2,4,998,9
1,99,,2,2,"F",1086,,43,23,11,,3,"M",6,2016,"U",,"U","N",,,"I64",238,70,,24,5,1,1,"R54",2,1,"I64",3,1,"I10",3,2,"E149",6,1,"R263",,,,,,,,,,,,,,,,,,,,,,,,,,,,,,,,,,,,,,,,,,,,,,5,"I64","E149","I10","R263","R54",,,,,,,,,,,,,,,,8,,,2,4,998,9
1,99,,2,3,"F",1062,,38,18,8,,1,"W",6,2016,"U",,"U","N",,,"C541",108,31,,10,10,1,1,"A419",2,1,"A415",3,1,"N390",6,1,"I959",6,2,"N179",6,3,"N189",6,4,"D649",6,5,"R34",6,6,"C541",6,7,"L033",,,,,,,,,,,,,,,,,,,,,,,,,,,,,,,9,"C541","A415","D649","I959","L033","N179","N189","N390","R34",,,,,,,,,,,,8,,,2,4,998,9
1,99,,2,3,"F",1058,,37,17,8,,3,"W",2,2016,"U",,"U","N",,,"I214",211,59,,21,8,1,1,"I219",2,1,"I251",2,2,"I214",3,1,"R688",6,1,"I632",6,2,"E149",6,3,"I64",6,4,"J984",,,,,,,,,,,,,,,,,,,,,,,,,,,,,,,,,,,,,6,"I214","E149","I251","I632","J984","R688",,,,,,,,,,,,,,,8,,,2,4,998,9
1,99,,2,3,"M",1049,,35,15,7,,1,"D",3,2016,"U",,"U","N",,,"C220",85,24,,15,4,1,1,"K922",2,1,"I859",3,1,"C220",6,1,"C443",,,,,,,,,,,,,,,,,,,,,,,,,,,,,,,,,,,,,,,,,,,,,,,,,3,"C220","C443","I850",,,,,,,,,,,,,,,,,,8,,,2,4,998,9
1,99,,2,3,"F",1059,,37,17,8,,3,"W",5,2016,"U",,"U","N",,,"I219",211,59,,21,6,1,1,"I219",2,1,"I48",3,1,"I500",6,1,"N189",6,2,"I10",6,3,"E149",,,,,,,,,,,,,,,,,,,,,,,,,,,,,,,,,,,,,,,,,,,5,"I219","E149","I120","I48","I500",,,,,,,,,,,,,,,,8,,,2,4,998,9
1,99,,2,3,"F",1047,,35,15,7,,3,"M",5,2016,"U",,"U","N",,,"E142",159,46,,16,4,1,1,"N185",2,1,"I10",3,1,"E149",6,1,"I500",,,,,,,,,,,,,,,,,,,,,,,,,,,,,,,,,,,,,,,,,,,,,,,,,4,"E142","E149","I120","I500",,,,,,,,,,,,,,,,,8,,,2,4,998,9
1,99,,2,3,"F",1082,,42,22,10,,3,"W",6,2016,"U",,"U","N",,,"E878",172,111,,37,3,1,1,"I219",2,1,"E878",6,1,"I10",,,,,,,,,,,,,,,,,,,,,,,,,,,,,,,,,,,,,,,,,,,,,,,,,,,,3,"E878","I10","I219",,,,,,,,,,,,,,,,,,8,,,2,4,998,9
1,99,,2,3,"M",1053,,36,16,7,,3,"M",6,2016,"U",,"U","N",,,"E668",169,111,,37,2,1,1,"I500",2,1,"E668",,,,,,,,,,,,,,,,,,,,,,,,,,,,,,,,,,,,,,,,,,,,,,,,,,,,,,,2,"E668","I500",,,,,,,,,,,,,,,,,,,8,,,2,4,998,9
1,99,,2,3,"F",1071,,40,20,9,,3,"M",5,2016,"U",,"U","N",,,"C541",108,31,,10,6,1,1,"C541",6,1,"A498",6,2,"E119",6,3,"R263",6,4,"J459",6,5,"N189",,,,,,,,,,,,,,,,,,,,,,,,,,,,,,,,,,,,,,,,,,,5,"C541","A498","E112","J459","R263",,,,,,,,,,,,,,,,8,,,2,4,998,9
1,99,,2,3,"F",1083,,42,22,10,,3,"W",1,2016,"U",,"U","N",,,"E149",159,46,,16,4,1,1,"I248",2,1,"I219",3,1,"E149",6,1,"R54",,,,,,,,,,,,,,,,,,,,,,,,,,,,,,,,,,,,,,,,,,,,,,,,,4,"E149","I219","I248","R54",,,,,,,,,,,,,,,,,8,,,2,4,998,9
1,99,,2,3,"F",1036,,33,13,6,,2,"M",1,2016,"U",,"U","N",,,"C169",78,22,,5,4,1,1,"G931",2,1,"G938",3,1,"C169",6,1,"D649",,,,,,,,,,,,,,,,,,,,,,,,,,,,,,,,,,,,,,,,,,,,,,,,,4,"C169","D649","G931","G938",,,,,,,,,,,,,,,,,8,,,2,4,998,9
1,99,,2,3,"F",1072,,40,20,9,,1,"W",2,2016,"U",,"U","N",,,"I38",226,68,,22,7,1,1,"I500",2,1,"I38",3,1,"A419",6,1,"I48",6,2,"E149",6,3,"I10",6,4,"I743",,,,,,,,,,,,,,,,,,,,,,,,,,,,,,,,,,,,,,,,7,"I38","A419","E149","I10","I48","I500","I743",,,,,,,,,,,,,,8,,,2,4,998,9
1,99,,2,3,"F",2001,,12,2,1,12,1,"S",4,2016,"U",,"U","N",,,"A099",11,3,3,37,4,1,1,"N179",1,2,"E872",2,1,"A099",2,2,"E86",,,,,,,,,,,,,,,,,,,,,,,,,,,,,,,,,,,,,,,,,,,,,,,,,4,"A099","E86","E872","N179",,,,,,,,,,,,,,,,,8,,,2,4,998,9
1,99,,2,3,"M",1072,,40,20,9,,1,"W",4,2016,"U",,"U","N",,,"C349",93,27,,8,4,1,1,"I219",2,1,"C349",6,1,"F179",6,2,"E149",,,,,,,,,,,,,,,,,,,,,,,,,,,,,,,,,,,,,,,,,,,,,,,,,4,"C349","E149","F179","I219",,,,,,,,,,,,,,,,,8,,,2,4,998,9
1,99,,2,3,"M",1090,,44,24,11,,3,"W",4,2016,"U",,"U","N",,,"I219",211,59,,21,4,1,1,"I248",2,1,"I219",3,1,"I259",6,1,"R54",,,,,,,,,,,,,,,,,,,,,,,,,,,,,,,,,,,,,,,,,,,,,,,,,4,"I219","I248","I259","R54",,,,,,,,,,,,,,,,,8,,,2,4,998,9
1,99,,2,3,"F",1075,,41,21,10,,1,"M",4,2016,"U",,"U","N",,,"I64",238,70,,24,7,1,1,"J189",2,1,"R263",3,1,"I64",6,1,"I10",6,2,"E119",6,3,"I251",6,4,"I500",,,,,,,,,,,,,,,,,,,,,,,,,,,,,,,,,,,,,,,,6,"I64","E119","I10","I251","I500","J182",,,,,,,,,,,,,,,8,,,2,4,998,9
1,99,,2,3,"M",1079,,41,21,10,,3,"M",5,2016,"U",,"U","N",,,"E149",159,46,,16,5,1,1,"I219",2,1,"I10",2,2,"I251",3,1,"E149",6,1,"M109",,,,,,,,,,,,,,,,,,,,,,,,,,,,,,,,,,,,,,,,,,,,,,5,"E149","I10","I219","I251","M109",,,,,,,,,,,,,,,,8,,,2,4,998,9
1,99,,2,3,"M",2009,,20,2,1,20,3,"S",5,2016,"U",,"U","N",,,"A099",11,3,3,37,6,1,1,"J690",1,2,"R092",1,3,"R579",2,1,"A419",2,2,"J189",3,1,"A099",,,,,,,,,,,,,,,,,,,,,,,,,,,,,,,,,,,,,,,,,,,6,"A099","A419","J189","J690","R092","R579",,,,,,,,,,,,,,,8,,,2,4,998,9
1,99,,2,3,"F",1069,,39,19,9,,3,"W",6,2016,"U",,"U","N",,,"C349",93,27,,8,1,1,1,"C349",,,,,,,,,,,,,,,,,,,,,,,,,,,,,,,,,,,,,,,,,,,,,,,,,,,,,,,,,,1,"C349",,,,,,,,,,,,,,,,,,,,8,,,2,4,998,9
1,99,,2,3,"M",1047,,35,15,7,,3,"M",7,2016,"U",,"U","N",,,"E668",169,111,,37,3,1,1,"I219",2,1,"F179",2,2,"E668",,,,,,,,,,,,,,,,,,,,,,,,,,,,,,,,,,,,,,,,,,,,,,,,,,,,3,"E668","F179","I219",,,,,,,,,,,,,,,,,,8,,,2,4,998,9
1,99,,2,3,"M",1073,,40,20,9,,3,"M",2,2016,"U",,"U","N",,,"C189",81,23,,6,2,1,1,"I219",2,1,"C189",,,,,,,,,,,,,,,,,,,,,,,,,,,,,,,,,,,,,,,,,,,,,,,,,,,,,,,2,"C189","I219",,,,,,,,,,,,,,,,,,,8,,,2,4,998,9
1,99,,2,3,"F",1078,,41,21,10,,3,"W",2,2016,"U",,"U","N",,,"E119",159,46,,16,4,1,1,"I219",3,1,"E119",3,2,"I10",3,3,"I64",,,,,,,,,,,,,,,,,,,,,,,,,,,,,,,,,,,,,,,,,,,,,,,,,4,"E119","I10","I219","I64",,,,,,,,,,,,,,,,,8,,,2,4,998,9
1,99,,2,3,"M",1059,,37,17,8,,3,"M",2,2016,"U",,"U","N",,,"I802",245,75,,37,6,1,1,"I269",2,1,"I802",6,1,"I10",6,2,"E039",6,3,"N189",6,4,"M109",,,,,,,,,,,,,,,,,,,,,,,,,,,,,,,,,,,,,,,,,,,5,"I802","E039","I120","I269","M109",,,,,,,,,,,,,,,,8,,,2,4,998,9
1,99,,2,3,"M",1063,,38,18,8,,1,"M",3,2016,"U",,"U","N",,,"I120",208,69,,23,3,1,1,"A419",3,1,"N185",3,2,"I10",,,,,,,,,,,,,,,,,,,,,,,,,,,,,,,,,,,,,,,,,,,,,,,,,,,,2,"I120","A419",,,,,,,,,,,,,,,,,,,8,,,2,4,998,9
1,99,,2,3,"F",1084,,42,22,10,,1,"W",5,2016,"U",,"U","N",,,"I694",239,70,,24,9,1,1,"A419",2,1,"R02",2,2,"L899",3,1,"J189",3,2,"I500",3,3,"D696",3,4,"I48",6,1,"I694",6,2,"G819",,,,,,,,,,,,,,,,,,,,,,,,,,,,,,,,,,9,"I694","A419","D696","G819","I48","I500","J189","L899","R02",,,,,,,,,,,,8,,,2,4,998,9
1,99,,2,4,"M",1070,,40,20,9,,1,"M",2,2016,"U",,"U","N",,,"D649",152,45,,37,10,1,1,"I249",1,2,"I219",2,1,"R579",2,2,"A419",3,1,"R02",3,2,"D649",3,3,"N19",6,1,"I48",6,2,"E790",6,3,"I10",,,,,,,,,,,,,,,,,,,,,,,,,,,,,,,9,"D649","A419","E790","I120","I219","I249","I48","R02","R579",,,,,,,,,,,,8,,,2,4,998,9
1,99,,2,4,"F",1083,,42,22,10,,1,"W",3,2016,"U",,"U","N",,,"E149",159,46,,16,4,1,1,"A419",2,1,"L031",3,1,"E149",6,1,"I64",,,,,,,,,,,,,,,,,,,,,,,,,,,,,,,,,,,,,,,,,,,,,,,,,4,"E149","A419","I64","L031",,,,,,,,,,,,,,,,,8,,,2,4,998,9
1,99,,2,4,"F",1063,,38,18,8,,1,"S",4,2016,"U",,"U","N",,,"K559",293,111,,37,8,1,1,"A419",2,1,"T814",6,1,"E149",6,2,"I10",6,3,"E46",6,4,"Y838",6,5,"Y836",6,6,"K559",,,,,,,,,,,,,,,,,,,,,,,,,,,,,,,,,,,,,8,"K559","A419","E149","E46","I10","T814","Y836","Y838",,,,,,,,,,,,,8,,,2,4,998,9
1,99,,2,4,"F",1055,,37,17,8,,1,"S",5,2016,"U",,"U","N",,,"E141",159,46,,16,10,1,1,"A419",2,1,"E141",2,2,"E872",3,1,"E878",3,2,"N179",3,3,"L038",3,4,"K922",6,1,"D696",6,2,"D649",6,3,"E149",,,,,,,,,,,,,,,,,,,,,,,,,,,,,,,8,"E141","A419","D649","D696","E878","K922","L038","N179",,,,,,,,,,,,,8,,,2,4,998,9
1,99,,2,4,"M",1069,,39,19,9,,3,"W",7,2016,"U",,"U","N",,,"I219",211,59,,21,2,1,1,"I219",2,1,"I709",,,,,,,,,,,,,,,,,,,,,,,,,,,,,,,,,,,,,,,,,,,,,,,,,,,,,,,2,"I219","I709",,,,,,,,,,,,,,,,,,,8,,,2,4,998,9
1,99,,2,4,"M",1034,,32,12,5,,3,"S",1,2016,"U",,"U","N",,,"I219",211,59,,21,6,1,1,"I219",2,1,"I500",3,1,"I10",6,1,"I48",6,2,"M109",6,3,"E668",,,,,,,,,,,,,,,,,,,,,,,,,,,,,,,,,,,,,,,,,,,6,"I219","E668","I10","I48","I500","M109",,,,,,,,,,,,,,,8,,,2,4,998,9
1,99,,2,4,"F",1057,,37,17,8,,1,"M",1,2016,"U",,"U","N",,,"A419",23,10,,37,8,1,1,"R402",2,1,"I619",3,1,"A419",3,2,"J22",6,1,"K922",6,2,"I10",6,3,"E149",6,4,"E669",,,,,,,,,,,,,,,,,,,,,,,,,,,,,,,,,,,,,7,"A419","E140","E669","I10","I619","J22","K922",,,,,,,,,,,,,,8,,,2,4,998,9
1,99,,2,4,"F",1046,,35,15,7,,3,"S",3,2016,"U",,"U","N",,,"C509",104,29,,9,2,1,1,"C509",3,1,"J90",,,,,,,,,,,,,,,,,,,,,,,,,,,,,,,,,,,,,,,,,,,,,,,,,,,,,,,2,"C509","J90",,,,,,,,,,,,,,,,,,,8,,,2,4,998,9
1,99,,2,4,"M",1064,,38,18,8,,3,"M",3,2016,"U",,"U","N",,,"I10",206,69,,23,4,1,1,"I499",2,1,"I10",2,2,"E149",6,1,"N40",,,,,,,,,,,,,,,,,,,,,,,,,,,,,,,,,,,,,,,,,,,,,,,,,4,"I10","E149","I499","N40",,,,,,,,,,,,,,,,,8,,,2,4,998,9
4,99,,2,4,"M",1024,,30,10,4,,3,"S",5,2016,"U",,"U","N",0,9,"W74",409,120,,39,2,1,1,"T751",1,2,"W74",,,,,,,,,,,,,,,,,,,,,,,,,,,,,,,,,,,,,,,,,,,,,,,,,,,,,,,2,"W74","T751",,,,,,,,,,,,,,,,,,,8,,,2,4,998,9
1,99,,2,4,"F",1054,,36,16,7,,1,"M",6,2016,"U",,"U","N",,,"I214",211,59,,21,8,1,1,"J80",2,1,"I214",3,1,"I501",6,1,"J22",6,2,"E149",6,3,"I10",6,4,"I500",6,5,"E669",,,,,,,,,,,,,,,,,,,,,,,,,,,,,,,,,,,,,8,"I214","E149","E669","I10","I500","I501","J22","J80",,,,,,,,,,,,,8,,,2,4,998,9
1,99,,2,4,"M",5999,,1,1,1,1,1,"S",2,2016,"U",,"U","N",,,"P832",364,108,116,33,2,1,1,"P832",6,1,"P073",,,,,,,,,,,,,,,,,,,,,,,,,,,,,,,,,,,,,,,,,,,,,,,,,,,,,,,1,"P832",,,,,,,,,,,,,,,,,,,,8,,,2,4,998,9
1,99,,2,4,"M",1063,,38,18,8,,3,"M",5,2016,"U",,"U","N",,,"I219",211,59,,21,4,1,1,"I219",2,1,"I251",6,1,"I48",6,2,"E149",,,,,,,,,,,,,,,,,,,,,,,,,,,,,,,,,,,,,,,,,,,,,,,,,4,"I219","E149","I251","I48",,,,,,,,,,,,,,,,,8,,,2,4,998,9
1,99,,2,4,"F",1075,,41,21,10,,1,"W",5,2016,"U",,"U","N",,,"D432",145,44,,37,2,1,1,"J969",2,1,"D432",,,,,,,,,,,,,,,,,,,,,,,,,,,,,,,,,,,,,,,,,,,,,,,,,,,,,,,2,"D432","J969",,,,,,,,,,,,,,,,,,,8,,,2,4,998,9
1,99,,2,4,"M",1053,,36,16,7,,1,"M",6,2016,"U",,"U","N",,,"E119",159,46,,16,5,1,1,"A410",2,1,"L022",3,1,"E119",6,1,"J80",6,2,"I10",,,,,,,,,,,,,,,,,,,,,,,,,,,,,,,,,,,,,,,,,,,,,,5,"E119","A410","I10","J80","L022",,,,,,,,,,,,,,,,8,,,2,4,998,9
1,99,,2,4,"M",1044,,34,14,6,,3,"S",7,2016,"U",,"U","N",,,"I219",211,59,,21,4,1,1,"I219",2,1,"I251",3,1,"I10",6,1,"I500",,,,,,,,,,,,,,,,,,,,,,,,,,,,,,,,,,,,,,,,,,,,,,,,,4,"I219","I10","I251","I500",,,,,,,,,,,,,,,,,8,,,2,4,998,9
1,99,,2,4,"M",1060,,38,18,8,,3,"M",7,2016,"U",,"U","N",,,"I219",211,59,,21,1,1,1,"I219",,,,,,,,,,,,,,,,,,,,,,,,,,,,,,,,,,,,,,,,,,,,,,,,,,,,,,,,,,1,"I219",,,,,,,,,,,,,,,,,,,,8,,,2,4,998,9
1,99,,2,4,"M",1073,,40,20,9,,1,"W",1,2016,"U",,"U","N",,,"N185",327,100,,31,9,1,1,"L031",1,2,"J81",1,3,"J189",2,1,"K729",2,2,"R18",3,1,"N185",3,2,"K746",6,1,"K922",6,2,"C80",,,,,,,,,,,,,,,,,,,,,,,,,,,,,,,,,,9,"N185","C80","J189","J81","K729","K746","K922","L031","R18",,,,,,,,,,,,8,,,2,4,998,9
1,99,,2,4,"F",4001,,3,1,1,3,1,"S",1,2016,"U",,"U","N",,,"P240",362,108,99,33,2,1,1,"P219",2,1,"P240",,,,,,,,,,,,,,,,,,,,,,,,,,,,,,,,,,,,,,,,,,,,,,,,,,,,,,,2,"P240","P219",,,,,,,,,,,,,,,,,,,8,,,2,4,998,9
1,99,,2,4,"M",4001,,3,1,1,3,1,"S",1,2016,"U",,"U","N",,,"P240",362,108,99,33,2,1,1,"P219",2,1,"P240",,,,,,,,,,,,,,,,,,,,,,,,,,,,,,,,,,,,,,,,,,,,,,,,,,,,,,,2,"P240","P219",,,,,,,,,,,,,,,,,,,8,,,2,4,998,9
1,99,,2,4,"F",1065,,39,19,9,,2,"M",1,2016,"U",,"U","N",,,"I219",211,59,,21,1,1,1,"I219",,,,,,,,,,,,,,,,,,,,,,,,,,,,,,,,,,,,,,,,,,,,,,,,,,,,,,,,,,1,"I219",,,,,,,,,,,,,,,,,,,,8,,,2,4,998,9
1,99,,2,4,"M",1067,,39,19,9,,3,"M",2,2016,"U",,"U","N",,,"E142",159,46,,16,3,1,1,"A419",2,1,"E149",2,2,"N185",,,,,,,,,,,,,,,,,,,,,,,,,,,,,,,,,,,,,,,,,,,,,,,,,,,,2,"E142","A419",,,,,,,,,,,,,,,,,,,8,,,2,4,998,9
1,99,,2,4,"M",1037,,33,13,6,,3,"M",7,2016,"U",,"U","N",,,"I219",211,59,,21,1,1,1,"I219",,,,,,,,,,,,,,,,,,,,,,,,,,,,,,,,,,,,,,,,,,,,,,,,,,,,,,,,,,1,"I219",,,,,,,,,,,,,,,,,,,,8,,,2,4,998,9
1,99,,2,4,"M",1086,,43,23,11,,1,"W",7,2016,"U",,"U","N",,,"E112",159,46,,16,7,1,1,"A419",2,1,"A419",3,1,"T876",3,2,"N390",6,1,"E119",6,2,"N19",6,3,"Y835",,,,,,,,,,,,,,,,,,,,,,,,,,,,,,,,,,,,,,,,5,"E112","A419","N390","T876","Y835",,,,,,,,,,,,,,,,8,,,2,4,998,9
1,99,,2,5,"F",1060,,38,18,8,,1,"W",3,2016,"U",,"U","N",,,"E116",159,46,,16,6,1,1,"A419",2,1,"J189",2,2,"N390",3,1,"E119",4,1,"I10",4,2,"N159",,,,,,,,,,,,,,,,,,,,,,,,,,,,,,,,,,,,,,,,,,,5,"E116","A419","I10","J189","N159",,,,,,,,,,,,,,,,8,,,2,4,998,9
1,99,,2,5,"M",1056,,37,17,8,,1,"W",4,2016,"U",,"U","N",,,"L031",308,111,,37,3,1,1,"A419",2,1,"K922",3,1,"L031",,,,,,,,,,,,,,,,,,,,,,,,,,,,,,,,,,,,,,,,,,,,,,,,,,,,3,"L031","A419","K922",,,,,,,,,,,,,,,,,,8,,,2,4,998,9
1,99,,2,5,"F",1084,,42,22,10,,3,"W",4,2016,"U",,"U","N",,,"I64",238,70,,24,3,1,1,"I469",2,1,"R54",3,1,"I64",,,,,,,,,,,,,,,,,,,,,,,,,,,,,,,,,,,,,,,,,,,,,,,,,,,,3,"I64","I469","R54",,,,,,,,,,,,,,,,,,8,,,2,4,998,9
1,99,,2,5,"F",1072,,40,20,9,,1,"M",5,2016,"U",,"U","N",,,"I639",237,70,,24,4,1,1,"I639",2,1,"I10",6,1,"E119",6,2,"I500",,,,,,,,,,,,,,,,,,,,,,,,,,,,,,,,,,,,,,,,,,,,,,,,,4,"I639","E119","I10","I500",,,,,,,,,,,,,,,,,1,,,1,1,998,9