"restatus","educ1989","educ2003","educflag","monthdth","sex","age","ageflag","ager52","ager27","ager12","ager22","placdth","marstat","weekday","year","injwork","mandeath","methdisp","autopsy","activity","injury","ucod","ucr358","ucr113","ucr130","ucr39","eanum","econdp_1","econds_1","enicon_1","econdp_2","econds_2","enicon_2","econdp_3","econds_3","enicon_3","econdp_4","econds_4","enicon_4","econdp_5","econds_5","enicon_5","econdp_6","econds_6","enicon_6","econdp_7","econds_7","enicon_7","econdp_8","econds_8","enicon_8","econdp_9","econds_9","enicon_9","econdp_10","econds_10","enicon_10","econdp_11","econds_11","enicon_11","econdp_12","econds_12","enicon_12","econdp_13","econds_13","enicon_13","econdp_14","econds_14","enicon_14","econdp_15","econds_15","enicon_15","econdp_16","econds_16","enicon_16","econdp_17","econds_17","enicon_17","econdp_18","econds_18","enicon_18","econdp_19","econds_19","enicon_19","econdp_20","econds_20","enicon_20","ranum","record_1","record_2","record_3","record_4","record_5","record_6","record_7","record_8","record_9","record_10","record_11","record_12","record_13","record_14","record_15","record_16","record_17","record_18","record_19","record_20","race","brace","raceimp","racer3","racer5","hispanic","hspanicr"
1,99,,2,1,"M",1073,,40,20,9,,1,"W",5,2015,"U",,"U","n",,,"N179",327,100,,31,6,1,1,"K659",1,2,"J189",2,1,"A419",2,2,"J969",3,1,"N179",6,1,"I10",,,,,,,,,,,,,,,,,,,,,,,,,,,,,,,,,,,,,,,,,,,6,"N179","A419","I10","J189","J969","K659",,,,,,,,,,,,,,,8,,,2,4,998,9
1,99,,2,1,"F",1052,,36,16,7,,3,"S",6,2015,"U",,"U","n",,,"I64",238,70,,24,7,1,1,"E86",1,2,"E878",2,1,"I64",2,2,"I694",6,1,"E149",6,2,"I10",6,3,"E669",,,,,,,,,,,,,,,,,,,,,,,,,,,,,,,,,,,,,,,,7,"I64","E149","E669","E86","E878","I10","I694",,,,,,,,,,,,,,8,,,2,4,998,9
1,99,,2,1,"F",1079,,41,21,10,,3,"W",3,2015,"U",,"U","n",,,"E86",172,111,,37,7,1,1,"E86",6,1,"R263",6,2,"I10",6,3,"E119",6,4,"E871",6,5,"R54",6,6,"R630",,,,,,,,,,,,,,,,,,,,,,,,,,,,,,,,,,,,,,,,7,"E86","E119","E871","I10","R263","R54","R630",,,,,,,,,,,,,,8,,,2,4,998,9
1,99,,2,1,"M",1071,,40,20,9,,2,"M",3,2015,"U",,"U","n",,,"I219",211,59,,21,2,1,1,"I219",2,1,"I10",,,,,,,,,,,,,,,,,,,,,,,,,,,,,,,,,,,,,,,,,,,,,,,,,,,,,,,2,"I219","I10",,,,,,,,,,,,,,,,,,,8,,,2,4,998,9
1,99,,2,1,"M",1071,,40,20,9,,1,"M",3,2015,"U",,"U","n",,,"C719",122,36,,15,3,1,1,"C80",2,1,"C719",6,1,"I10",,,,,,,,,,,,,,,,,,,,,,,,,,,,,,,,,,,,,,,,,,,,,,,,,,,,2,"C719","I10",,,,,,,,,,,,,,,,,,,8,,,2,4,998,9
1,99,,2,1,"M",1060,,38,18,8,,3,"M",4,2015,"U",,"U","U",,,"C679",118,35,,12,6,1,1,"A419",2,1,"J22",6,1,"E149",6,2,"I10",6,3,"N185",6,4,"C679",,,,,,,,,,,,,,,,,,,,,,,,,,,,,,,,,,,,,,,,,,,5,"C679","A419","E142","I10","J22",,,,,,,,,,,,,,,,8,,,2,4,998,9
1,99,,2,1,"M",1074,,40,20,9,,1,"M",4,2015,"U",,"U","n",,,"E142",159,46,,16,7,1,1,"A419",1,2,"J189",2,1,"N19",3,1,"E875",6,1,"E149",6,2,"I10",6,3,"N189",,,,,,,,,,,,,,,,,,,,,,,,,,,,,,,,,,,,,,,,5,"E142","A419","E875","I120","J189",,,,,,,,,,,,,,,,8,,,2,4,998,9
1,99,,2,1,"M",1077,,41,21,10,,2,"M",5,2015,"U",,"U","n",,,"C402",96,43,,15,5,1,1,"I269",2,1,"J81",3,1,"C402",6,1,"E149",6,2,"I10",,,,,,,,,,,,,,,,,,,,,,,,,,,,,,,,,,,,,,,,,,,,,,5,"C402","E149","I10","I269","J81",,,,,,,,,,,,,,,,8,,,2,4,998,9
1,99,,2,1,"M",1059,,37,17,8,,1,"W",6,2015,"U",,"U","n",,,"A419",23,10,,37,7,1,1,"J189",1,2,"A419",2,1,"R048",6,1,"I500",6,2,"E119",6,3,"I10",6,4,"D45",,,,,,,,,,,,,,,,,,,,,,,,,,,,,,,,,,,,,,,,7,"A419","D45","E119","I10","I500","J189","R048",,,,,,,,,,,,,,8,,,2,4,998,9
1,99,,2,1,"M",1082,,42,22,10,,1,"M",7,2015,"U",,"U","n",,,"J189",257,78,,27,4,1,1,"R092",2,1,"J189",6,1,"E149",6,2,"I500",,,,,,,,,,,,,,,,,,,,,,,,,,,,,,,,,,,,,,,,,,,,,,,,,4,"J189","E149","I500","R092",,,,,,,,,,,,,,,,,8,,,2,4,998,9
1,99,,2,1,"M",1052,,36,16,7,,1,"M",2,2015,"U",,"U","n",,,"E112",159,46,,16,11,1,1,"I629",1,2,"K922",2,1,"Y442",6,1,"N185",6,2,"E119",6,3,"I10",6,4,"I500",6,5,"I251",6,6,"I259",6,7,"I258",6,8,"G473",,,,,,,,,,,,,,,,,,,,,,,,,,,,9,"E112","G473","I10","I251","I258","I500","I629","K922","Y442",,,,,,,,,,,,8,,,2,4,998,9
1,99,,2,1,"M",1069,,39,19,9,,1,"M",5,2015,"U",,"U","n",,,"I219",211,59,,21,7,1,1,"I499",2,1,"I219",3,1,"I251",6,1,"E119",6,2,"I10",6,3,"N189",6,4,"A419",,,,,,,,,,,,,,,,,,,,,,,,,,,,,,,,,,,,,,,,6,"I219","A419","E112","I10","I251","I499",,,,,,,,,,,,,,,1,,,1,1,998,9
1,99,,2,1,"M",1077,,41,21,10,,3,"M",6,2015,"U",,"U","U",,,"I219",211,59,,21,8,1,1,"I248",2,1,"I219",3,1,"I259",6,1,"I509",6,2,"I64",6,3,"I38",6,4,"D649",6,5,"E119",,,,,,,,,,,,,,,,,,,,,,,,,,,,,,,,,,,,,8,"I219","D649","E119","I248","I259","I38","I509","I64",,,,,,,,,,,,,8,,,2,4,998,9
4,99,,2,1,"M",1053,,36,16,7,,3,"M",6,2015,"U",,"U","U",,,"I219",211,59,,21,1,1,1,"I219",,,,,,,,,,,,,,,,,,,,,,,,,,,,,,,,,,,,,,,,,,,,,,,,,,,,,,,,,,1,"I219",,,,,,,,,,,,,,,,,,,,8,,,2,4,998,9
1,99,,2,1,"M",1030,,32,12,5,,1,"S",6,2015,"U",,"U","n",,,"A279",24,18,,37,6,1,1,"R048",2,1,"D696",3,1,"A279",6,1,"K767",6,2,"I518",6,3,"K859",,,,,,,,,,,,,,,,,,,,,,,,,,,,,,,,,,,,,,,,,,,6,"A279","D696","I518","K767","K859","R048",,,,,,,,,,,,,,,8,,,2,4,998,9
1,99,,2,1,"F",1085,,43,23,11,,1,"W",7,2015,"U",,"U","n",,,"I64",238,70,,24,7,1,1,"A419",2,1,"J189",3,1,"I64",6,1,"E119",6,2,"I10",6,3,"N19",6,4,"I500",,,,,,,,,,,,,,,,,,,,,,,,,,,,,,,,,,,,,,,,6,"I64","A419","E112","I10","I500","J189",,,,,,,,,,,,,,,8,,,2,4,998,9
1,99,,2,1,"F",1088,,43,23,11,,3,"W",3,2015,"U",,"U","n",,,"E149",159,46,,16,7,1,1,"A419",2,1,"L899",3,1,"E149",4,1,"I10",6,1,"T931",6,2,"R263",6,3,"Y86",,,,,,,,,,,,,,,,,,,,,,,,,,,,,,,,,,,,,,,,7,"E149","A419","I10","L899","R263","T931","Y86",,,,,,,,,,,,,,8,,,2,4,998,9
1,99,,2,1,"M",1075,,41,21,10,,1,"M",3,2015,"U",,"U","n",,,"E119",159,46,,16,4,1,1,"I219",2,1,"E119",3,1,"J189",6,1,"I10",,,,,,,,,,,,,,,,,,,,,,,,,,,,,,,,,,,,,,,,,,,,,,,,,4,"E119","I10","I219","J189",,,,,,,,,,,,,,,,,8,,,2,4,998,9
1,99,,2,1,"F",1037,,33,13,6,,3,"S",3,2015,"U",,"U","n",,,"I248",212,60,,21,7,1,1,"I248",2,1,"I249",3,1,"I500",6,1,"I958",6,2,"N189",6,3,"B749",6,4,"E669",,,,,,,,,,,,,,,,,,,,,,,,,,,,,,,,,,,,,,,,6,"I248","B749","E669","I500","I958","N189",,,,,,,,,,,,,,,8,,,2,4,998,9
1,99,,2,1,"F",1047,,35,15,7,,3,"S",3,2015,"U",,"U","n",,,"I219",211,59,,21,3,1,1,"I248",2,1,"I219",3,1,"I500",,,,,,,,,,,,,,,,,,,,,,,,,,,,,,,,,,,,,,,,,,,,,,,,,,,,3,"I219","I248","I500",,,,,,,,,,,,,,,,,,8,,,2,4,998,9
1,99,,2,1,"M",1066,,39,19,9,,1,"W",4,2015,"U",,"U","n",,,"J440",267,86,,28,4,1,1,"J969",2,1,"J449",2,2,"J441",3,1,"J189",,,,,,,,,,,,,,,,,,,,,,,,,,,,,,,,,,,,,,,,,,,,,,,,,3,"J440","J441","J969",,,,,,,,,,,,,,,,,,8,,,2,4,998,9
1,99,,2,1,"M",1043,,34,14,6,,1,"S",4,2015,"U",,"U","n",,,"C349",93,27,,8,3,1,1,"C349",6,1,"F179",6,2,"F101",,,,,,,,,,,,,,,,,,,,,,,,,,,,,,,,,,,,,,,,,,,,,,,,,,,,3,"C349","F101","F179",,,,,,,,,,,,,,,,,,8,,,2,4,998,9
1,99,,2,1,"F",1039,,33,13,6,,1,"S",6,2015,"U",,"U","n",,,"L899",309,111,,37,6,1,1,"A419",2,1,"J189",3,1,"L899",6,1,"R263",6,2,"G809",6,3,"R568",,,,,,,,,,,,,,,,,,,,,,,,,,,,,,,,,,,,,,,,,,,5,"L899","A419","G809","J182","R568",,,,,,,,,,,,,,,,8,,,2,4,998,9
1,99,,2,1,"M",1032,,32,12,5,,3,"M",6,2015,"U",,"U","n",,,"G409",191,111,,37,4,1,1,"R090",2,1,"R068",3,1,"G409",6,1,"J459",,,,,,,,,,,,,,,,,,,,,,,,,,,,,,,,,,,,,,,,,,,,,,,,,4,"G409","J459","R068","R090",,,,,,,,,,,,,,,,,7,,,2,4,998,9
1,99,,2,1,"F",1016,,29,9,4,,3,"S",6,2015,"U",1,"U","n",9,9,"W74",409,120,,39,2,1,1,"T751",1,2,"W74",,,,,,,,,,,,,,,,,,,,,,,,,,,,,,,,,,,,,,,,,,,,,,,,,,,,,,,2,"W74","T751",,,,,,,,,,,,,,,,,,,8,,,2,4,998,9
1,99,,2,1,"M",1057,,37,17,8,,3,"M",6,2015,"U",,"U","n",,,"C169",78,22,,5,3,1,1,"E86",1,2,"E46",2,1,"C169",,,,,,,,,,,,,,,,,,,,,,,,,,,,,,,,,,,,,,,,,,,,,,,,,,,,3,"C169","E46","E86",,,,,,,,,,,,,,,,,,8,,,2,4,998,9
1,99,,2,1,"M",1077,,41,21,10,,3,"M",2,2015,"U",,"U","n",,,"J690",273,88,,37,2,1,1,"J690",2,1,"R13",,,,,,,,,,,,,,,,,,,,,,,,,,,,,,,,,,,,,,,,,,,,,,,,,,,,,,,2,"J690","R13",,,,,,,,,,,,,,,,,,,8,,,2,4,998,9
1,99,,2,1,"M",1060,,38,18,8,,3,"M",2,2015,"U",,"U","n",,,"I219",211,59,,21,3,1,1,"I219",2,1,"I10",2,2,"E119",,,,,,,,,,,,,,,,,,,,,,,,,,,,,,,,,,,,,,,,,,,,,,,,,,,,3,"I219","E119","I10",,,,,,,,,,,,,,,,,,8,,,2,4,998,9
1,99,,2,1,"F",1052,,36,16,7,,3,"M",3,2015,"U",,"U","n",,,"I516",233,68,,22,2,1,1,"I516",2,1,"I469",,,,,,,,,,,,,,,,,,,,,,,,,,,,,,,,,,,,,,,,,,,,,,,,,,,,,,,2,"I516","I469",,,,,,,,,,,,,,,,,,,8,,,2,4,998,9
1,99,,2,1,"M",1057,,37,17,8,,1,"M",5,2015,"U",,"U","n",,,"E119",159,46,,16,5,1,1,"I219",2,1,"E119",6,1,"J189",6,2,"A419",6,3,"I10",,,,,,,,,,,,,,,,,,,,,,,,,,,,,,,,,,,,,,,,,,,,,,5,"E119","A419","I10","I219","J189",,,,,,,,,,,,,,,,8,,,2,4,998,9
1,99,,2,1,"F",1070,,40,20,9,,1,"W",5,2015,"U",,"U","n",,9,"I64",238,70,,24,6,1,1,"J189",1,2,"T179",1,3,"W80",2,1,"I64",3,1,"I10",6,1,"E149",,,,,,,,,,,,,,,,,,,,,,,,,,,,,,,,,,,,,,,,,,,6,"I64","E149","I10","J189","T179","W80",,,,,,,,,,,,,,,8,,,2,4,998,9
1,99,,2,1,"M",1076,,41,21,10,,1,"W",6,2015,"U",,"U","n",,,"I249",212,60,,21,5,1,1,"I249",2,1,"R570",6,1,"J449",6,2,"I500",6,3,"L409",,,,,,,,,,,,,,,,,,,,,,,,,,,,,,,,,,,,,,,,,,,,,,5,"I249","I500","J449","L409","R570",,,,,,,,,,,,,,,,8,,,2,4,998,9
1,99,,2,1,"M",1079,,41,21,10,,3,"M",7,2015,"U",,"U","n",,,"N390",330,111,,37,7,1,1,"I499",1,2,"I469",2,1,"N185",2,2,"E878",3,1,"N390",6,1,"I500",6,2,"I10",,,,,,,,,,,,,,,,,,,,,,,,,,,,,,,,,,,,,,,,6,"N390","E878","I120","I469","I499","I500",,,,,,,,,,,,,,,8,,,2,4,998,9
1,99,,2,1,"F",1060,,38,18,8,,1,"S",7,2015,"U",,"U","n",,,"A419",23,10,,37,5,1,1,"A419",6,1,"E149",6,2,"M480",6,3,"D649",6,4,"N189",,,,,,,,,,,,,,,,,,,,,,,,,,,,,,,,,,,,,,,,,,,,,,4,"A419","D649","E142","M480",,,,,,,,,,,,,,,,,8,,,2,4,998,9
1,99,,2,1,"F",1044,,34,14,6,,3,"M",7,2015,"U",,"U","n",,,"I219",211,59,,21,3,1,1,"I248",2,1,"I219",3,1,"I10",,,,,,,,,,,,,,,,,,,,,,,,,,,,,,,,,,,,,,,,,,,,,,,,,,,,3,"I219","I10","I248",,,,,,,,,,,,,,,,,,8,,,2,4,998,9
1,99,,2,2,"M",1048,,35,15,7,,3,"M",1,2015,"U",,"U","n",,,"E102",159,46,,16,9,1,1,"I219",2,1,"R688",3,1,"N185",3,2,"I500",3,3,"K922",3,4,"E780",6,1,"D649",6,2,"I10",6,3,"E109",,,,,,,,,,,,,,,,,,,,,,,,,,,,,,,,,,9,"E102","D649","E109","E780","I120","I219","I500","K922","R688",,,,,,,,,,,,8,,,2,4,998,9
1,99,,2,2,"M",1057,,37,17,8,,1,"M",2,2015,"U",,"U","n",,,"E142",159,46,,16,7,1,1,"K922",2,1,"I259",2,2,"K746",3,1,"N189",3,2,"I10",6,1,"E149",6,2,"E790",,,,,,,,,,,,,,,,,,,,,,,,,,,,,,,,,,,,,,,,7,"E142","E149","E790","I120","I259","K746","K922",,,,,,,,,,,,,,8,,,2,4,998,9
1,99,,2,2,"M",1036,,33,13,6,,1,"S",3,2015,"U",,"U","n",,,"G809",193,111,,37,3,1,1,"J189",2,1,"G809",3,1,"D619",,,,,,,,,,,,,,,,,,,,,,,,,,,,,,,,,,,,,,,,,,,,,,,,,,,,3,"G809","D619","J189",,,,,,,,,,,,,,,,,,8,,,2,4,998,9
1,99,,2,2,"M",1028,,31,11,5,,1,"S",3,2015,"U",,"U","n",,,"G210",188,51,,37,7,1,1,"G210",2,1,"N19",2,2,"G934",2,3,"K219",2,4,"I10",2,5,"I500",3,1,"E669",,,,,,,,,,,,,,,,,,,,,,,,,,,,,,,,,,,,,,,,6,"G210","E669","G934","I120","I500","K219",,,,,,,,,,,,,,,8,,,2,4,998,9
1,99,,2,2,"F",1078,,41,21,10,,1,"W",7,2015,"U",,"U","n",,9,"I64",238,70,,24,7,1,1,"I219",2,1,"J189",2,2,"T179",2,3,"W80",3,1,"I64",6,1,"I10",6,2,"K859",,,,,,,,,,,,,,,,,,,,,,,,,,,,,,,,,,,,,,,,7,"I64","I10","I219","J189","K859","T179","W80",,,,,,,,,,,,,,1,,,1,1,998,9
1,99,,2,2,"F",1078,,41,21,10,,3,"W",7,2015,"U",,"U","n",,,"E149",159,46,,16,3,1,1,"E46",2,1,"E149",3,1,"I10",,,,,,,,,,,,,,,,,,,,,,,,,,,,,,,,,,,,,,,,,,,,,,,,,,,,3,"E149","E46","I10",,,,,,,,,,,,,,,,,,8,,,2,4,998,9
1,99,,2,2,"M",1055,,37,17,8,,1,"M",2,2015,"U",,"U","n",,,"E112",159,46,,16,7,1,1,"I219",2,1,"I251",3,1,"E119",6,1,"J189",6,2,"I10",6,3,"M109",6,4,"N189",,,,,,,,,,,,,,,,,,,,,,,,,,,,,,,,,,,,,,,,6,"E112","I10","I219","I251","J189","M109",,,,,,,,,,,,,,,8,,,2,4,998,9
1,99,,2,2,"M",1005,,27,7,3,,1,"S",4,2015,"U",1,"U","n",9,,"V092",397,114,,38,3,1,1,"I469",2,1,"S069",3,1,"V092",,,,,,,,,,,,,,,,,,,,,,,,,,,,,,,,,,,,,,,,,,,,,,,,,,,,3,"V092","I469","S069",,,,,,,,,,,,,,,,,,8,,,2,4,998,9
1,99,,2,2,"M",1046,,35,15,7,,3,"S",6,2015,"U",,"U","n",,,"E149",159,46,,16,3,1,1,"I219",2,1,"I471",3,1,"E149",,,,,,,,,,,,,,,,,,,,,,,,,,,,,,,,,,,,,,,,,,,,,,,,,,,,3,"E149","I219","I471",,,,,,,,,,,,,,,,,,8,,,2,4,998,9
1,99,,2,2,"M",1083,,42,22,10,,1,"W",7,2015,"U",,"U","n",,,"J189",257,78,,27,2,1,1,"J189",6,1,"I48",,,,,,,,,,,,,,,,,,,,,,,,,,,,,,,,,,,,,,,,,,,,,,,,,,,,,,,2,"J189","I48",,,,,,,,,,,,,,,,,,,8,,,2,4,998,9
1,99,,2,2,"M",1072,,40,20,9,,1,"M",2,2015,"U",,"U","n",,,"C61",113,33,,11,6,1,1,"J969",2,1,"C780",3,1,"C61",6,1,"E119",6,2,"I10",6,3,"E785",,,,,,,,,,,,,,,,,,,,,,,,,,,,,,,,,,,,,,,,,,,6,"C61","C780","E119","E785","I10","J969",,,,,,,,,,,,,,,8,,,2,4,998,9
1,99,,2,2,"F",1053,,36,16,7,,3,"S",2,2015,"U",,"U","n",,,"C80",125,43,,15,6,1,1,"C80",2,1,"E86",2,2,"R64",3,1,"C80",6,1,"N189",6,2,"N200",,,,,,,,,,,,,,,,,,,,,,,,,,,,,,,,,,,,,,,,,,,5,"C80","E86","N189","N200","R64",,,,,,,,,,,,,,,,8,,,2,4,998,9
1,99,,2,2,"F",1081,,42,22,10,,1,"W",3,2015,"U",,"U","n",,,"E112",159,46,,16,6,1,1,"A410",2,1,"N185",3,1,"E119",6,1,"I10",6,2,"J189",6,3,"D649",,,,,,,,,,,,,,,,,,,,,,,,,,,,,,,,,,,,,,,,,,,5,"E112","A410","D649","I10","J189",,,,,,,,,,,,,,,,8,,,2,4,998,9
1,99,,2,2,"M",1086,,43,23,11,,1,"M",7,2015,"U",,"U","n",,,"C80",125,43,,15,4,1,1,"I639",2,1,"C80",6,1,"I48",6,2,"K639",,,,,,,,,,,,,,,,,,,,,,,,,,,,,,,,,,,,,,,,,,,,,,,,,4,"C80","I48","I639","K639",,,,,,,,,,,,,,,,,8,,,2,4,998,9
1,99,,2,2,"F",1092,,44,24,11,,3,"W",1,2015,"U",,"U","U",,,"J459",268,85,,28,2,1,1,"J459",6,1,"R54",,,,,,,,,,,,,,,,,,,,,,,,,,,,,,,,,,,,,,,,,,,,,,,,,,,,,,,2,"J459","R54",,,,,,,,,,,,,,,,,,,8,,,2,4,998,9
1,99,,2,2,"M",1054,,36,16,7,,3,"M",1,2015,"U",,"U","n",,,"J448",267,86,,28,6,1,1,"J969",1,2,"I519",2,1,"J449",2,2,"J459",3,1,"F179",6,1,"F179",,,,,,,,,,,,,,,,,,,,,,,,,,,,,,,,,,,,,,,,,,,4,"J448","F179","I519","J969",,,,,,,,,,,,,,,,,8,,2,2,4,998,9
1,99,,2,2,"M",1074,,40,20,9,,1,"M",3,2015,"U",,"U","n",,,"E112",159,46,,16,6,1,1,"I219",2,1,"N185",3,1,"E119",6,1,"I10",6,2,"D649",6,3,"M109",,,,,,,,,,,,,,,,,,,,,,,,,,,,,,,,,,,,,,,,,,,5,"E112","D649","I10","I219","M109",,,,,,,,,,,,,,,,8,,,2,4,998,9
1,99,,2,2,"M",1053,,36,16,7,,2,"M",3,2015,"U",,"U","n",,9,"I499",228,68,,22,3,1,1,"I499",6,1,"T754",6,2,"W87",,,,,,,,,,,,,,,,,,,,,,,,,,,,,,,,,,,,,,,,,,,,,,,,,,,,3,"I499","T754","W87",,,,,,,,,,,,,,,,,,8,,,2,4,998,9
1,99,,2,2,"M",1046,,35,15,7,,3,"M",4,2015,"U",,"U","n",,,"E669",169,111,,37,5,1,1,"A419",2,1,"L97",2,2,"L039",3,1,"I878",4,1,"E669",,,,,,,,,,,,,,,,,,,,,,,,,,,,,,,,,,,,,,,,,,,,,,5,"E669","A419","I878","L039","L97",,,,,,,,,,,,,,,,8,,,2,4,998,9
1,99,,2,2,"M",1062,,38,18,8,,1,"S",4,2015,"U",,"U","n",,,"C349",93,27,,8,5,1,1,"C349",2,1,"E149",2,2,"I10",2,3,"E790",2,4,"E785",,,,,,,,,,,,,,,,,,,,,,,,,,,,,,,,,,,,,,,,,,,,,,5,"C349","E149","E785","E790","I10",,,,,,,,,,,,,,,,8,,,2,4,998,9
1,99,,2,2,"F",1029,,31,11,5,,1,"S",5,2015,"U",,"U","n",,,"E230",160,111,,37,8,1,1,"R570",2,1,"A419",2,2,"J189",3,1,"E230",6,1,"E232",6,2,"I64",6,3,"E039",6,4,"H540",,,,,,,,,,,,,,,,,,,,,,,,,,,,,,,,,,,,,8,"E230","A419","E039","E232","H540","I64","J189","R570",,,,,,,,,,,,,8,,,2,4,998,9
1,99,,2,2,"M",1051,,36,16,7,,3,"S",7,2015,"U",,"U","n",,,"I219",211,59,,21,6,1,1,"I219",2,1,"I48",2,2,"I500",3,1,"I10",3,2,"J449",3,3,"G473",,,,,,,,,,,,,,,,,,,,,,,,,,,,,,,,,,,,,,,,,,,6,"I219","G473","I10","I48","I500","J449",,,,,,,,,,,,,,,8,,,2,4,998,9
1,99,,2,3,"M",1049,,35,15,7,,3,"M",1,2015,"U",,"U","n",,,"Y839",456,135,,39,5,1,1,"T817",2,1,"Y839",6,1,"I64",6,2,"E119",6,3,"A410",,,,,,,,,,,,,,,,,,,,,,,,,,,,,,,,,,,,,,,,,,,,,,5,"Y839","A410","E119","I64","T817",,,,,,,,,,,,,,,,8,,,2,4,998,9
1,99,,2,3,"F",1049,,35,15,7,,1,"M",1,2015,"U",,"U","n",,,"E112",159,46,,16,4,1,1,"N185",2,1,"E119",3,1,"I10",6,1,"D649",,,,,,,,,,,,,,,,,,,,,,,,,,,,,,,,,,,,,,,,,,,,,,,,,3,"E112","D649","I10",,,,,,,,,,,,,,,,,,8,,,2,4,998,9
1,99,,2,3,"F",1086,,43,23,11,,1,"W",1,2015,"U",,"U","n",,,"E871",172,111,,37,5,1,1,"I469",2,1,"J189",3,1,"E871",6,1,"R263",6,2,"M245",,,,,,,,,,,,,,,,,,,,,,,,,,,,,,,,,,,,,,,,,,,,,,4,"E871","I469","J182","M245",,,,,,,,,,,,,,,,,8,,,2,4,998,9
1,99,,2,3,"M",2011,,22,2,1,22,1,"S",1,2015,"U",,"U","n",,,"A069",9,2,2,37,2,1,1,"J189",6,1,"A069",,,,,,,,,,,,,,,,,,,,,,,,,,,,,,,,,,,,,,,,,,,,,,,,,,,,,,,2,"A069","J189",,,,,,,,,,,,,,,,,,,8,,,2,4,998,9
1,99,,2,3,"M",1086,,43,23,11,,3,"W",3,2015,"U",,"U","n",,,"C20",82,23,,6,4,1,1,"D649",1,2,"K566",2,1,"R630",3,1,"C20",,,,,,,,,,,,,,,,,,,,,,,,,,,,,,,,,,,,,,,,,,,,,,,,,4,"C20","D649","K566","R630",,,,,,,,,,,,,,,,,8,,,2,4,998,9
1,99,,2,3,"M",1061,,38,18,8,,2,"M",3,2015,"U",,"U","n",,,"E142",159,46,,16,4,1,1,"E162",2,1,"N185",3,1,"E149",3,2,"C119",,,,,,,,,,,,,,,,,,,,,,,,,,,,,,,,,,,,,,,,,,,,,,,,,3,"E142","C119","E162",,,,,,,,,,,,,,,,,,8,,,2,4,998,9
1,99,,2,3,"M",1055,,37,17,8,,3,"M",4,2015,"U",,"U","n",,,"E119",159,46,,16,2,1,1,"E46",2,1,"E119",,,,,,,,,,,,,,,,,,,,,,,,,,,,,,,,,,,,,,,,,,,,,,,,,,,,,,,2,"E119","E46",,,,,,,,,,,,,,,,,,,8,,,2,4,998,9
1,99,,2,3,"M",1081,,42,22,10,,3,"W",4,2015,"U",,"U","n",9,9,"W80",410,123,,39,2,1,1,"T179",1,2,"W80",,,,,,,,,,,,,,,,,,,,,,,,,,,,,,,,,,,,,,,,,,,,,,,,,,,,,,,2,"W80","T179",,,,,,,,,,,,,,,,,,,8,,,2,4,998,9
1,99,,2,3,"M",1086,,43,23,11,,1,"M",5,2015,"U",,"U","n",,,"J440",267,86,,28,4,1,1,"J189",2,1,"J449",2,2,"J47",3,1,"E46",,,,,,,,,,,,,,,,,,,,,,,,,,,,,,,,,,,,,,,,,,,,,,,,,3,"J440","E46","J47",,,,,,,,,,,,,,,,,,8,,,2,4,998,9
1,99,,2,3,"M",1052,,36,16,7,,3,"M",1,2015,"U",,"U","n",,,"E149",159,46,,16,5,1,1,"I219",2,1,"I249",3,1,"E149",3,2,"I10",6,1,"I48",,,,,,,,,,,,,,,,,,,,,,,,,,,,,,,,,,,,,,,,,,,,,,5,"E149","I10","I219","I249","I48",,,,,,,,,,,,,,,,8,,,2,4,998,9
1,99,,2,3,"F",1088,,43,23,11,,3,"W",7,2015,"U",,"U","n",,,"I219",211,59,,21,3,1,1,"I219",2,1,"I10",2,2,"E119",,,,,,,,,,,,,,,,,,,,,,,,,,,,,,,,,,,,,,,,,,,,,,,,,,,,3,"I219","E119","I10",,,,,,,,,,,,,,,,,,8,,,2,4,998,9
1,99,,2,3,"F",1064,,38,18,8,,3,"M",3,2015,"U",,"U","n",,,"C859",129,39,,13,5,1,1,"E878",1,2,"E872",2,1,"G936",3,1,"C859",4,1,"I64",,,,,,,,,,,,,,,,,,,,,,,,,,,,,,,,,,,,,,,,,,,,,,5,"C859","E872","E878","G936","I64",,,,,,,,,,,,,,,,8,,,2,4,998,9
1,99,,2,3,"M",1062,,38,18,8,,1,"S",5,2015,"U",,"U","n",,,"J440",267,86,,28,6,1,1,"J969",2,1,"J189",3,1,"J449",6,1,"J984",6,2,"F209",6,3,"L039",,,,,,,,,,,,,,,,,,,,,,,,,,,,,,,,,,,,,,,,,,,4,"J440","F209","J969","L039",,,,,,,,,,,,,,,,,8,,,2,4,998,9
4,99,,2,3,"M",1068,,39,19,9,,3,"M",6,2015,"U",1,"U","n",9,9,"W74",409,120,,39,2,1,1,"T751",1,2,"W74",,,,,,,,,,,,,,,,,,,,,,,,,,,,,,,,,,,,,,,,,,,,,,,,,,,,,,,2,"W74","T751",,,,,,,,,,,,,,,,,,,1,,,1,1,998,9
1,99,,2,3,"F",1041,,34,14,6,,3,"M",2,2015,"U",,"U","n",,,"E149",159,46,,16,4,1,1,"I219",2,1,"I10",3,1,"E149",6,1,"E785",,,,,,,,,,,,,,,,,,,,,,,,,,,,,,,,,,,,,,,,,,,,,,,,,4,"E149","E785","I10","I219",,,,,,,,,,,,,,,,,8,,,2,4,998,9
1,99,,2,3,"M",1052,,36,16,7,,3,"M",3,2015,"U",,"U","U",,,"I64",238,70,,24,6,1,1,"N390",6,1,"N19",6,2,"D649",6,3,"E119",6,4,"I10",6,5,"I64",,,,,,,,,,,,,,,,,,,,,,,,,,,,,,,,,,,,,,,,,,,5,"I64","D649","E112","I10","N390",,,,,,,,,,,,,,,,8,,,2,4,998,9
1,99,,2,3,"F",1076,,41,21,10,,3,"W",3,2015,"U",,"U","n",,,"E43",167,48,,37,4,1,1,"E878",2,1,"E43",3,1,"I64",6,1,"G309",,,,,,,,,,,,,,,,,,,,,,,,,,,,,,,,,,,,,,,,,,,,,,,,,4,"E43","E878","G309","I64",,,,,,,,,,,,,,,,,8,,,2,4,998,9
1,99,,2,4,"F",1059,,37,17,8,,3,"S",4,2015,"U",,"U","U",,,"A419",23,10,,37,4,1,1,"I219",2,1,"A419",3,1,"A419",3,2,"L031",,,,,,,,,,,,,,,,,,,,,,,,,,,,,,,,,,,,,,,,,,,,,,,,,3,"A419","I219","L031",,,,,,,,,,,,,,,,,,8,,,2,4,998,9
1,99,,2,4,"M",1080,,42,22,10,,1,"W",4,2015,"U",,"U","n",,,"C119",74,20,,15,4,1,1,"I469",2,1,"C119",3,1,"R688",6,1,"R64",,,,,,,,,,,,,,,,,,,,,,,,,,,,,,,,,,,,,,,,,,,,,,,,,4,"C119","I469","R64","R688",,,,,,,,,,,,,,,,,8,,,2,4,998,9
4,99,,2,4,"M",1034,,32,12,5,,2,"M",5,2015,"Y",1,"U","n",9,9,"X599",423,123,,39,3,1,1,"S099",6,1,"S420",6,2,"X599",,,,,,,,,,,,,,,,,,,,,,,,,,,,,,,,,,,,,,,,,,,,,,,,,,,,3,"X599","S099","S420",,,,,,,,,,,,,,,,,,8,,,2,4,998,9
4,99,,2,4,"M",1057,,37,17,8,,1,"M",5,2015,"U",,"U","n",,,"J690",273,88,,37,5,1,1,"A419",2,1,"J690",6,1,"J80",6,2,"K255",6,3,"K659",,,,,,,,,,,,,,,,,,,,,,,,,,,,,,,,,,,,,,,,,,,,,,5,"J690","A419","J80","K255","K659",,,,,,,,,,,,,,,,8,,,2,4,998,9
1,99,,2,4,"F",1045,,35,15,7,,1,"S",6,2015,"U",,"U","n",,,"I64",238,70,,24,12,1,1,"I469",2,1,"A419",2,2,"G610",3,1,"I64",3,2,"L899",3,3,"I48",3,4,"J189",3,5,"A010",3,6,"A419",3,7,"R688",6,1,"E86",6,2,"K121",,,,,,,,,,,,,,,,,,,,,,,,,11,"I64","A010","A419","E86","G610","I469","I48","J189","K121","L899","R688",,,,,,,,,,8,,,2,4,998,9
1,99,,2,4,"M",1069,,39,19,9,,1,"M",5,2015,"U",,"U","n",,,"I219",211,59,,21,6,1,1,"R570",2,1,"J81",3,1,"I219",6,1,"E119",6,2,"I10",6,3,"N19",,,,,,,,,,,,,,,,,,,,,,,,,,,,,,,,,,,,,,,,,,,5,"I219","E112","I10","J81","R570",,,,,,,,,,,,,,,,8,,,2,4,998,9
1,99,,2,4,"F",1038,,33,13,6,,3,"M",3,2015,"U",,"U","n",,,"E102",159,46,,16,6,1,1,"I219",2,1,"E109",3,1,"I10",6,1,"E785",6,2,"N049",6,3,"B349",,,,,,,,,,,,,,,,,,,,,,,,,,,,,,,,,,,,,,,,,,,5,"E102","B349","E785","I10","I219",,,,,,,,,,,,,,,,8,,,2,4,998,9
1,99,,2,4,"M",1064,,38,18,8,,1,"M",3,2015,"U",,"U","n",,,"E112",159,46,,16,7,1,1,"I500",2,1,"I251",3,1,"E119",6,1,"N185",6,2,"I10",6,3,"I519",6,4,"E878",,,,,,,,,,,,,,,,,,,,,,,,,,,,,,,,,,,,,,,,5,"E112","E878","I10","I251","I500",,,,,,,,,,,,,,,,8,,,2,4,998,9
1,99,,2,4,"F",1048,,35,15,7,,3,"M",5,2015,"U",,"U","n",,,"C56",109,32,,10,3,1,1,"D649",2,1,"N838",3,1,"C56",,,,,,,,,,,,,,,,,,,,,,,,,,,,,,,,,,,,,,,,,,,,,,,,,,,,3,"C56","D649","N838",,,,,,,,,,,,,,,,,,8,,,2,4,998,9
1,99,,2,4,"F",1069,,39,19,9,,1,"W",7,2015,"U",,"U","n",,,"I64",238,70,,24,5,1,1,"A419",2,1,"R263",3,1,"I64",6,1,"K746",6,2,"N19",,,,,,,,,,,,,,,,,,,,,,,,,,,,,,,,,,,,,,,,,,,,,,5,"I64","A419","K746","N19","R263",,,,,,,,,,,,,,,,8,,,2,4,998,9
1,99,,2,4,"M",1089,,43,23,11,,3,"M",7,2015,"U",,"U","n",,,"I500",230,67,,22,6,1,1,"A419",2,1,"R688",3,1,"I500",6,1,"I10",6,2,"E785",6,3,"E790",,,,,,,,,,,,,,,,,,,,,,,,,,,,,,,,,,,,,,,,,,,6,"I500","A419","E785","E790","I10","R688",,,,,,,,,,,,,,,8,,,2,4,998,9
1,99,,2,4,"F",1078,,41,21,10,,2,"W",7,2015,"U",,"U","n",,,"C169",78,22,,5,4,1,1,"D649",2,1,"K920",2,2,"K254",3,1,"C169",,,,,,,,,,,,,,,,,,,,,,,,,,,,,,,,,,,,,,,,,,,,,,,,,4,"C169","D649","K254","K920",,,,,,,,,,,,,,,,,8,,,2,4,998,9
1,99,,2,4,"M",1078,,41,21,10,,3,"M",7,2015,"U",,"U","n",,,"E149",159,46,,16,3,1,1,"I219",2,1,"E149",3,1,"I10",,,,,,,,,,,,,,,,,,,,,,,,,,,,,,,,,,,,,,,,,,,,,,,,,,,,3,"E149","I10","I219",,,,,,,,,,,,,,,,,,8,,,2,4,998,9
1,99,,2,4,"F",1089,,43,23,11,,1,"W",7,2015,"U",,"U","n",,,"I38",226,68,,22,5,1,1,"I500",2,1,"I38",6,1,"E149",6,2,"J449",6,3,"I48",,,,,,,,,,,,,,,,,,,,,,,,,,,,,,,,,,,,,,,,,,,,,,5,"I38","E149","I48","I500","J449",,,,,,,,,,,,,,,,8,,,2,4,998,9
1,99,,2,4,"M",1067,,39,19,9,,1,"M",7,2015,"U",,"U","y",,9,"I619",236,70,,24,7,1,1,"G935",2,1,"I619",3,1,"I672",3,2,"I517",3,3,"I251",6,1,"S024",6,2,"X590",,,,,,,,,,,,,,,,,,,,,,,,,,,,,,,,,,,,,,,,7,"I619","G935","I251","I517","I672","S024","X590",,,,,,,,,,,,,,8,,,2,4,998,9
1,99,,2,4,"M",1077,,41,21,10,,3,"W",5,2015,"U",,"U","n",,,"G20",188,51,,37,7,1,1,"A419",1,2,"L899",2,1,"J189",3,1,"G20",6,1,"F03",6,2,"R263",6,3,"D649",,,,,,,,,,,,,,,,,,,,,,,,,,,,,,,,,,,,,,,,6,"G20","A419","D649","F03","J182","L899",,,,,,,,,,,,,,,1,,,1,1,998,9
1,99,,2,4,"M",1067,,39,19,9,,3,"M",5,2015,"U",,"U","n",,,"C169",78,22,,5,2,1,1,"C169",2,1,"C80",,,,,,,,,,,,,,,,,,,,,,,,,,,,,,,,,,,,,,,,,,,,,,,,,,,,,,,1,"C169",,,,,,,,,,,,,,,,,,,,8,,,2,4,998,9
1,99,,2,4,"M",1050,,36,16,7,,3,"S",6,2015,"U",,"U","n",,,"I219",211,59,,21,4,1,1,"I219",6,1,"I48",6,2,"I10",6,3,"I500",,,,,,,,,,,,,,,,,,,,,,,,,,,,,,,,,,,,,,,,,,,,,,,,,4,"I219","I10","I48","I500",,,,,,,,,,,,,,,,,8,,,2,4,998,9
1,99,,2,4,"F",1065,,39,19,9,,3,"W",1,2015,"U",,"U","n",,,"I059",201,55,,22,13,1,1,"J90",1,2,"C80",2,1,"T828",2,2,"E877",2,3,"I251",2,4,"I500",3,1,"Y831",3,2,"I059",6,1,"E119",6,2,"I10",6,3,"M109",6,4,"I619",6,5,"G819",,,,,,,,,,,,,,,,,,,,,,13,"I059","C80","E119","E877","G819","I10","I251","I500","I619","J90","M109","T828","Y831",,,,,,,,8,,,2,4,998,9
1,99,,2,4,"F",1065,,39,19,9,,3,"W",2,2015,"U",,"U","n",,,"I219",211,59,,21,4,1,1,"I219",2,1,"I509",3,1,"I10",6,1,"F179",,,,,,,,,,,,,,,,,,,,,,,,,,,,,,,,,,,,,,,,,,,,,,,,,4,"I219","F179","I10","I509",,,,,,,,,,,,,,,,,8,,,2,4,998,9
1,99,,2,4,"F",1069,,39,19,9,,1,"W",5,2015,"U",,"U","n",,,"L984",309,111,,37,5,1,1,"A419",2,1,"L984",6,1,"N185",6,2,"E46",6,3,"G049",,,,,,,,,,,,,,,,,,,,,,,,,,,,,,,,,,,,,,,,,,,,,,5,"L984","A419","E46","G049","N185",,,,,,,,,,,,,,,,8,,,2,4,998,9