"restatus","educ1989","educ2003","educflag","monthdth","sex","age","ageflag","ager52","ager27","ager12","ager22","placdth","marstat","weekday","year","injwork","mandeath","methdisp","autopsy","activity","injury","ucod","ucr358","ucr113","ucr130","ucr39","eanum","econdp_1","econds_1","enicon_1","econdp_2","econds_2","enicon_2","econdp_3","econds_3","enicon_3","econdp_4","econds_4","enicon_4","econdp_5","econds_5","enicon_5","econdp_6","econds_6","enicon_6","econdp_7","econds_7","enicon_7","econdp_8","econds_8","enicon_8","econdp_9","econds_9","enicon_9","econdp_10","econds_10","enicon_10","econdp_11","econds_11","enicon_11","econdp_12","econds_12","enicon_12","econdp_13","econds_13","enicon_13","econdp_14","econds_14","enicon_14","econdp_15","econds_15","enicon_15","econdp_16","econds_16","enicon_16","econdp_17","econds_17","enicon_17","econdp_18","econds_18","enicon_18","econdp_19","econds_19","enicon_19","econdp_20","econds_20","enicon_20","ranum","record_1","record_2","record_3","record_4","record_5","record_6","record_7","record_8","record_9","record_10","record_11","record_12","record_13","record_14","record_15","record_16","record_17","record_18","record_19","record_20","race","brace","raceimp","racer3","racer5","hispanic","hspanicr"
2,99,,2,1,"F",1068,,39,19,9,,1,"M",4,2014,"U",,"U","N",,9,"A099",11,3,,37,7,1,1,"E898",2,1,"Y849",3,1,"R99",4,1,"A099",6,1,"T659",6,2,"X49",6,3,"E149",,,,,,,,,,,,,,,,,,,,,,,,,,,,,,,,,,,,,,,,7,"A099","E149","E898","R99","T659","X49","Y849",,,,,,,,,,,,,,8,,,2,4,998,9
2,99,,2,1,"F",1042,,34,14,6,,1,"M",7,2014,"U",,"U","N",,,"C480",103,43,,15,4,1,1,"J969",2,1,"C780",3,1,"C480",6,1,"E149",,,,,,,,,,,,,,,,,,,,,,,,,,,,,,,,,,,,,,,,,,,,,,,,,4,"C480","C780","E149","J969",,,,,,,,,,,,,,,,,8,,,2,4,998,9
2,99,,2,1,"F",1082,,42,22,10,,1,"W",7,2014,"U",,"U","N",,,"E119",159,46,,16,3,1,1,"A419",2,1,"E119",3,1,"I64",,,,,,,,,,,,,,,,,,,,,,,,,,,,,,,,,,,,,,,,,,,,,,,,,,,,3,"E119","A419","I64",,,,,,,,,,,,,,,,,,8,,,2,4,998,9
2,99,,2,1,"F",1089,,43,23,11,,3,"W",7,2014,"U",,"U","N",,,"L893",309,111,,37,4,1,1,"A419",2,1,"L899",3,1,"L893",6,1,"R263",,,,,,,,,,,,,,,,,,,,,,,,,,,,,,,,,,,,,,,,,,,,,,,,,3,"L893","A419","R263",,,,,,,,,,,,,,,,,,8,,,2,4,998,9
2,99,,2,1,"M",1068,,39,19,9,,2,"M",1,2014,"U",,"U","N",,,"I219",211,59,,21,2,1,1,"I500",2,1,"I219",,,,,,,,,,,,,,,,,,,,,,,,,,,,,,,,,,,,,,,,,,,,,,,,,,,,,,,2,"I219","I500",,,,,,,,,,,,,,,,,,,8,,,2,4,998,9
2,99,,2,1,"F",1076,,41,21,10,,1,"W",1,2014,"U",,"U","N",,,"I639",237,70,,24,6,1,1,"A419",2,1,"J189",3,1,"I64",3,2,"I639",3,3,"I10",6,1,"E668",,,,,,,,,,,,,,,,,,,,,,,,,,,,,,,,,,,,,,,,,,,5,"I639","A419","E668","I10","J189",,,,,,,,,,,,,,,,8,,,2,4,998,9
2,99,,2,1,"F",1057,,37,17,8,,1,"M",2,2014,"U",,"U","N",,,"E140",159,46,,16,5,1,1,"E140",2,1,"C349",3,1,"I64",6,1,"E149",6,2,"I10",,,,,,,,,,,,,,,,,,,,,,,,,,,,,,,,,,,,,,,,,,,,,,4,"E140","C349","I10","I64",,,,,,,,,,,,,,,,,8,,,2,4,998,9
2,99,,2,1,"F",1094,,44,24,11,,3,"W",3,2014,"U",,"U","N",,,"E86",172,111,,37,5,1,1,"E86",2,1,"R688",6,1,"N189",6,2,"N200",6,3,"N133",,,,,,,,,,,,,,,,,,,,,,,,,,,,,,,,,,,,,,,,,,,,,,4,"E86","N132","N189","R688",,,,,,,,,,,,,,,,,8,,,2,4,998,9
2,99,,2,1,"M",1021,,30,10,4,,1,"S",4,2014,"U",,"U","N",,,"I639",237,70,,24,5,1,1,"A419",2,1,"J189",2,2,"N390",3,1,"I639",6,1,"F069",,,,,,,,,,,,,,,,,,,,,,,,,,,,,,,,,,,,,,,,,,,,,,5,"I639","A419","F069","J189","N390",,,,,,,,,,,,,,,,8,,,2,4,998,9
2,99,,2,1,"F",1064,,38,18,8,,1,"M",4,2014,"U",,"U","N",,,"I691",239,70,,24,5,1,1,"A419",2,1,"J189",2,2,"N390",3,1,"I691",6,1,"I639",,,,,,,,,,,,,,,,,,,,,,,,,,,,,,,,,,,,,,,,,,,,,,5,"I691","A419","I639","J189","N390",,,,,,,,,,,,,,,,8,,,2,4,998,9
2,99,,2,1,"F",1051,,36,16,7,,3,"M",5,2014,"U",,"U","N",,,"I219",211,59,,21,4,1,1,"I219",2,1,"D649",3,1,"I10",3,2,"I517",,,,,,,,,,,,,,,,,,,,,,,,,,,,,,,,,,,,,,,,,,,,,,,,,4,"I219","D649","I10","I517",,,,,,,,,,,,,,,,,8,,,2,4,998,9
2,99,,2,1,"M",1053,,36,16,7,,1,"S",1,2014,"U",,"U","U",,9,"K761",301,111,,37,8,1,1,"J180",1,2,"J439",2,1,"K761",2,2,"D732",3,1,"E43",6,1,"S065",6,2,"S099",6,3,"X599",,,,,,,,,,,,,,,,,,,,,,,,,,,,,,,,,,,,,8,"K761","D732","E43","J180","J439","S065","S099","X599",,,,,,,,,,,,,8,,,2,4,998,9
2,99,,2,1,"M",1074,,40,20,9,,1,"M",5,2014,"U",,"U","N",,,"C229",85,24,,15,3,1,1,"R64",2,1,"C229",2,2,"C80",,,,,,,,,,,,,,,,,,,,,,,,,,,,,,,,,,,,,,,,,,,,,,,,,,,,2,"C229","R64",,,,,,,,,,,,,,,,,,,8,,,2,4,998,9
2,99,,2,1,"F",1067,,39,19,9,,1,"D",6,2014,"U",,"U","N",,,"C349",93,27,,8,2,1,1,"C349",2,1,"J189",,,,,,,,,,,,,,,,,,,,,,,,,,,,,,,,,,,,,,,,,,,,,,,,,,,,,,,2,"C349","J189",,,,,,,,,,,,,,,,,,,8,,,2,4,998,9
2,99,,2,1,"M",1043,,34,14,6,,3,"M",6,2014,"U",,"U","N",,,"E149",159,46,,16,2,2,1,"I10",3,1,"E149",,,,,,,,,,,,,,,,,,,,,,,,,,,,,,,,,,,,,,,,,,,,,,,,,,,,,,,2,"E149","I10",,,,,,,,,,,,,,,,,,,8,,,2,4,998,9
2,99,,2,1,"F",1062,,38,18,8,,3,"W",7,2014,"U",,"U","N",,,"E149",159,46,,16,5,1,1,"I499",3,1,"E149",3,2,"I10",3,3,"E785",6,1,"M109",,,,,,,,,,,,,,,,,,,,,,,,,,,,,,,,,,,,,,,,,,,,,,5,"E149","E785","I10","I499","M109",,,,,,,,,,,,,,,,8,,,2,4,998,9
2,99,,2,1,"M",2002,,13,2,1,13,3,"S",2,2014,"U",1,"U","Y",9,8,"W75",411,123,146,39,3,1,1,"T71",1,2,"W75",6,1,"P080",,,,,,,,,,,,,,,,,,,,,,,,,,,,,,,,,,,,,,,,,,,,,,,,,,,,3,"W75","P080","T71",,,,,,,,,,,,,,,,,,8,,,2,4,998,9
2,99,,2,1,"M",1054,,36,16,7,,3,"S",1,2014,"U",,"U","Y",,,"I619",236,70,,24,2,1,1,"I619",1,2,"I64",,,,,,,,,,,,,,,,,,,,,,,,,,,,,,,,,,,,,,,,,,,,,,,,,,,,,,,1,"I619",,,,,,,,,,,,,,,,,,,,8,,,2,4,998,9
2,99,,2,1,"F",1060,,38,18,8,,1,"M",3,2014,"U",,"U","N",,,"E149",159,46,,16,3,1,1,"A410",2,1,"E149",2,2,"Y841",,,,,,,,,,,,,,,,,,,,,,,,,,,,,,,,,,,,,,,,,,,,,,,,,,,,3,"E149","A410","Y841",,,,,,,,,,,,,,,,,,8,,,2,4,998,9
2,99,,2,1,"M",1050,,36,16,7,,3,"M",6,2014,"U",,"U","N",,,"E790",173,111,,37,5,1,1,"I219",2,1,"I10",2,2,"I517",2,3,"I500",3,1,"E790",,,,,,,,,,,,,,,,,,,,,,,,,,,,,,,,,,,,,,,,,,,,,,5,"E790","I10","I219","I500","I517",,,,,,,,,,,,,,,,8,,,2,4,998,9
2,99,,2,1,"F",1074,,40,20,9,,1,"W",1,2014,"U",,"U","N",,,"C679",118,35,,12,4,1,1,"N390",2,1,"C679",6,1,"E149",6,2,"K922",,,,,,,,,,,,,,,,,,,,,,,,,,,,,,,,,,,,,,,,,,,,,,,,,4,"C679","E149","K922","N390",,,,,,,,,,,,,,,,,8,,,2,4,998,9
2,99,,2,1,"F",1048,,35,15,7,,3,"M",3,2014,"U",,"U","N",,,"C509",104,29,,9,2,1,1,"C509",1,2,"C80",,,,,,,,,,,,,,,,,,,,,,,,,,,,,,,,,,,,,,,,,,,,,,,,,,,,,,,1,"C509",,,,,,,,,,,,,,,,,,,,8,,,2,4,998,9
2,99,,2,1,"M",1071,,40,20,9,,3,"M",6,2014,"U",,"U","N",,,"I219",211,59,,21,2,1,1,"I219",6,1,"M109",,,,,,,,,,,,,,,,,,,,,,,,,,,,,,,,,,,,,,,,,,,,,,,,,,,,,,,2,"I219","M109",,,,,,,,,,,,,,,,,,,8,,,2,4,998,9
2,99,,2,1,"M",1060,,38,18,8,,1,"M",5,2014,"U",,"U","N",,,"I219",211,59,,21,6,1,1,"R570",2,1,"I219",3,1,"I959",4,1,"R688",6,1,"I10",6,2,"E149",,,,,,,,,,,,,,,,,,,,,,,,,,,,,,,,,,,,,,,,,,,6,"I219","E149","I10","I959","R570","R688",,,,,,,,,,,,,,,8,,,2,4,998,9
2,99,,2,2,"M",1090,,44,24,11,,3,"W",7,2014,"U",,"U","N",,,"R688",380,110,,36,1,1,1,"R688",,,,,,,,,,,,,,,,,,,,,,,,,,,,,,,,,,,,,,,,,,,,,,,,,,,,,,,,,,1,"R688",,,,,,,,,,,,,,,,,,,,8,,,2,4,998,9
2,99,,2,2,"F",1060,,38,18,8,,1,"M",1,2014,"U",,"U","N",,,"C539",107,30,,10,4,1,1,"C539",6,1,"D649",6,2,"E149",6,3,"I10",,,,,,,,,,,,,,,,,,,,,,,,,,,,,,,,,,,,,,,,,,,,,,,,,4,"C539","D649","E149","I10",,,,,,,,,,,,,,,,,8,,,2,4,998,9
2,99,,2,2,"M",1058,,37,17,8,,1,"M",2,2014,"U",,"U","N",,,"I619",236,70,,24,4,1,1,"I619",2,1,"J189",6,1,"I48",6,2,"I10",,,,,,,,,,,,,,,,,,,,,,,,,,,,,,,,,,,,,,,,,,,,,,,,,4,"I619","I10","I48","J189",,,,,,,,,,,,,,,,,8,,,2,4,998,9
2,99,,2,2,"M",1048,,35,15,7,,1,"M",3,2014,"U",,"U","N",,,"I609",235,70,,24,4,1,1,"I609",2,1,"I10",3,1,"J189",6,1,"N179",,,,,,,,,,,,,,,,,,,,,,,,,,,,,,,,,,,,,,,,,,,,,,,,,4,"I609","I10","J189","N179",,,,,,,,,,,,,,,,,8,,,2,4,998,9
2,99,,2,2,"M",1083,,42,22,10,,3,"M",7,2014,"U",,"U","N",,,"I219",211,59,,21,2,1,1,"R99",2,1,"I219",,,,,,,,,,,,,,,,,,,,,,,,,,,,,,,,,,,,,,,,,,,,,,,,,,,,,,,2,"I219","R99",,,,,,,,,,,,,,,,,,,1,,,1,1,998,9
2,99,,2,2,"M",1054,,36,16,7,,3,"M",4,2014,"U",,"U","N",,,"I10",206,69,,23,2,1,1,"I469",3,1,"I10",,,,,,,,,,,,,,,,,,,,,,,,,,,,,,,,,,,,,,,,,,,,,,,,,,,,,,,2,"I10","I469",,,,,,,,,,,,,,,,,,,8,,,2,4,998,9
2,99,,2,2,"F",1087,,43,23,11,,1,"W",5,2014,"U",,"U","N",,,"D649",152,45,,37,8,1,1,"J969",1,2,"A419",2,1,"J90",6,1,"E149",6,2,"I10",6,3,"I500",6,4,"D649",6,5,"D70",,,,,,,,,,,,,,,,,,,,,,,,,,,,,,,,,,,,,8,"D649","A419","D70","E149","I10","I500","J90","J969",,,,,,,,,,,,,8,,,2,4,998,9
2,99,,2,2,"M",1041,,34,14,6,,1,"M",4,2014,"N",3,"U","Y",9,8,"Y08",441,129,,41,9,1,1,"S068",1,2,"S029",1,3,"S020",1,4,"S021",3,1,"S099",3,2,"Y08",6,1,"T179",6,2,"W80",6,3,"J189",,,,,,,,,,,,,,,,,,,,,,,,,,,,,,,,,,9,"Y08","J189","S020","S021","S029","S068","S099","T179","W80",,,,,,,,,,,,8,,,2,4,998,9
2,99,,2,2,"F",1088,,43,23,11,,1,"W",4,2014,"U",,"U","N",,,"J189",257,78,,27,3,1,1,"J969",2,1,"I219",3,1,"J189",,,,,,,,,,,,,,,,,,,,,,,,,,,,,,,,,,,,,,,,,,,,,,,,,,,,3,"J189","I219","J969",,,,,,,,,,,,,,,,,,8,,2,2,4,998,9
2,99,,2,2,"M",1069,,39,19,9,,3,"M",4,2014,"U",,"U","N",,,"E109",159,46,,16,8,1,1,"I219",2,1,"I709",3,1,"E109",3,2,"I10",6,1,"R263",6,2,"L984",6,3,"D649",6,4,"E46",,,,,,,,,,,,,,,,,,,,,,,,,,,,,,,,,,,,,8,"E109","D649","E46","I10","I219","I709","L984","R263",,,,,,,,,,,,,8,,,2,4,998,9
2,99,,2,2,"M",1061,,38,18,8,,3,"M",5,2014,"U",,"U","N",,,"C349",93,27,,8,5,1,1,"C349",2,1,"I10",2,2,"E149",2,3,"J90",2,4,"N19",,,,,,,,,,,,,,,,,,,,,,,,,,,,,,,,,,,,,,,,,,,,,,4,"C349","E149","I120","J90",,,,,,,,,,,,,,,,,8,,,2,4,998,9
2,99,,2,2,"M",1072,,40,20,9,,1,"M",6,2014,"U",,"U","N",,9,"I38",226,68,,22,12,1,1,"R688",2,1,"I500",2,2,"S720",3,1,"I38",3,2,"N179",6,1,"J189",6,2,"I10",6,3,"E149",6,4,"I48",6,5,"I64",6,6,"T093",6,7,"X590",,,,,,,,,,,,,,,,,,,,,,,,,12,"I38","E149","I10","I48","I500","I64","J189","N179","R688","S720","T093","X590",,,,,,,,,8,,,2,4,998,9
2,99,,2,2,"M",1034,,32,12,5,,3,"S",7,2014,"N",3,"U","Y",9,9,"Y09",441,129,,41,7,1,1,"S069",2,1,"S099",2,2,"S029",3,1,"S099",3,2,"Y09",6,1,"T519",6,2,"X89",,,,,,,,,,,,,,,,,,,,,,,,,,,,,,,,,,,,,,,,6,"Y09","S029","S069","S099","T519","X89",,,,,,,,,,,,,,,8,,,2,4,998,9
2,99,,2,2,"M",1026,,31,11,5,,3,"S",1,2014,"Y",1,"U","N",9,8,"X599",423,123,,39,3,1,1,"S099",1,2,"S18",6,1,"X599",,,,,,,,,,,,,,,,,,,,,,,,,,,,,,,,,,,,,,,,,,,,,,,,,,,,3,"X599","S099","S18",,,,,,,,,,,,,,,,,,1,,,1,1,998,9
2,99,,2,2,"F",1070,,40,20,9,,3,"W",1,2014,"U",,"U","N",,,"I64",238,70,,24,5,1,1,"I219",2,1,"I64",2,2,"G819",3,1,"I10",3,2,"I48",,,,,,,,,,,,,,,,,,,,,,,,,,,,,,,,,,,,,,,,,,,,,,5,"I64","G819","I10","I219","I48",,,,,,,,,,,,,,,,8,,,2,4,998,9
2,99,,2,2,"F",1002,,24,4,2,,3,"S",5,2014,"U",1,"U","N",9,9,"W74",409,120,,39,5,1,1,"T751",1,2,"W74",2,1,"J81",2,2,"J90",3,1,"T751",,,,,,,,,,,,,,,,,,,,,,,,,,,,,,,,,,,,,,,,,,,,,,4,"W74","J81","J90","T751",,,,,,,,,,,,,,,,,8,,,2,4,998,9
2,99,,2,2,"F",1065,,39,19,9,,3,"W",6,2014,"U",,"U","N",,,"I500",230,67,,22,4,2,1,"I48",3,1,"I500",6,1,"I10",6,2,"E149",,,,,,,,,,,,,,,,,,,,,,,,,,,,,,,,,,,,,,,,,,,,,,,,,4,"I500","E149","I10","I48",,,,,,,,,,,,,,,,,8,,,2,4,998,9
2,99,,2,2,"F",1017,,29,9,4,,3,"S",7,2014,"U",1,"U","N",9,9,"W74",409,120,,39,2,1,1,"T751",1,2,"W74",,,,,,,,,,,,,,,,,,,,,,,,,,,,,,,,,,,,,,,,,,,,,,,,,,,,,,,2,"W74","T751",,,,,,,,,,,,,,,,,,,8,,,2,4,998,9
2,99,,2,2,"F",1080,,42,22,10,,1,"W",1,2014,"U",,"U","N",,,"E538",168,49,,37,3,1,1,"J189",2,1,"E538",3,1,"I469",,,,,,,,,,,,,,,,,,,,,,,,,,,,,,,,,,,,,,,,,,,,,,,,,,,,3,"E538","I469","J189",,,,,,,,,,,,,,,,,,8,,,2,4,998,9
2,99,,2,2,"M",1060,,38,18,8,,1,"S",6,2014,"U",,"U","N",,,"J440",267,86,,28,6,1,1,"J189",2,1,"J449",2,2,"N390",3,1,"G20",6,1,"R068",6,2,"D649",,,,,,,,,,,,,,,,,,,,,,,,,,,,,,,,,,,,,,,,,,,5,"J440","D649","G20","N390","R068",,,,,,,,,,,,,,,,8,,,2,4,998,9
2,99,,2,2,"F",1041,,34,14,6,,3,"M",3,2014,"U",,"U","N",,,"I110",207,56,,20,5,1,1,"I499",2,1,"G473",2,2,"E668",3,1,"I500",4,1,"I10",,,,,,,,,,,,,,,,,,,,,,,,,,,,,,,,,,,,,,,,,,,,,,6,"I110","E668","G473","I10","I499","I500",,,,,,,,,,,,,,,8,,,2,4,998,9
2,99,,2,2,"M",1080,,42,22,10,,1,"M",2,2014,"U",,"U","N",,,"I219",211,59,,21,5,1,1,"I219",6,1,"N185",6,2,"I259",6,3,"E149",6,4,"I10",,,,,,,,,,,,,,,,,,,,,,,,,,,,,,,,,,,,,,,,,,,,,,4,"I219","E142","I10","I259",,,,,,,,,,,,,,,,,8,,,2,4,998,9
2,99,,2,2,"M",1077,,41,21,10,,1,"W",3,2014,"U",,"U","U",,9,"A409",23,10,,37,13,1,1,"J960",2,1,"T179",2,2,"W80",3,1,"A419",4,1,"A409",6,1,"J189",6,2,"N185",6,3,"E119",6,4,"I10",6,5,"I251",6,6,"I500",6,7,"M259",6,8,"M869",,,,,,,,,,,,,,,,,,,,,,11,"A409","E112","I10","I251","I500","J189","J960","M259","M869","T179","W80",,,,,,,,,,8,,,2,4,998,9
2,99,,2,2,"M",1083,,42,22,10,,1,"W",4,2014,"U",,"U","N",,,"E46",167,48,,37,4,1,1,"A419",2,1,"J189",3,1,"L899",6,1,"E46",,,,,,,,,,,,,,,,,,,,,,,,,,,,,,,,,,,,,,,,,,,,,,,,,4,"E46","A419","J189","L899",,,,,,,,,,,,,,,,,8,,,2,4,998,9
2,99,,2,2,"F",1060,,38,18,8,,1,"D",5,2014,"U",,"U","N",,,"C349",93,27,,8,3,1,1,"C349",2,1,"J189",2,2,"J90",,,,,,,,,,,,,,,,,,,,,,,,,,,,,,,,,,,,,,,,,,,,,,,,,,,,3,"C349","J189","J90",,,,,,,,,,,,,,,,,,8,,,2,4,998,9
2,99,,2,2,"F",1070,,40,20,9,,1,"M",5,2014,"U",,"U","N",,,"E112",159,46,,16,5,1,1,"I619",2,1,"I10",3,1,"N185",6,1,"E119",6,2,"D649",,,,,,,,,,,,,,,,,,,,,,,,,,,,,,,,,,,,,,,,,,,,,,5,"E112","D649","E119","I120","I619",,,,,,,,,,,,,,,,8,,,2,4,998,9
2,99,,2,3,"M",1042,,34,14,6,,3,"S",7,2014,"U",,"U","N",,,"J459",268,85,,28,2,1,1,"I499",3,1,"J459",,,,,,,,,,,,,,,,,,,,,,,,,,,,,,,,,,,,,,,,,,,,,,,,,,,,,,,2,"J459","I499",,,,,,,,,,,,,,,,,,,1,,,1,1,998,9
2,99,,2,3,"F",1081,,42,22,10,,1,"W",3,2014,"U",,"U","N",,,"E149",159,46,,16,4,1,1,"E46",2,1,"L899",3,1,"E149",3,2,"I10",,,,,,,,,,,,,,,,,,,,,,,,,,,,,,,,,,,,,,,,,,,,,,,,,4,"E149","E46","I10","L899",,,,,,,,,,,,,,,,,8,,,2,4,998,9
4,99,,2,3,"M",1068,,39,19,9,,3,"W",1,2014,"U",,"U","N",,,"I219",211,59,,21,1,1,1,"I219",,,,,,,,,,,,,,,,,,,,,,,,,,,,,,,,,,,,,,,,,,,,,,,,,,,,,,,,,,1,"I219",,,,,,,,,,,,,,,,,,,,8,,,2,4,998,9
2,99,,2,3,"M",1083,,42,22,10,,3,"W",3,2014,"U",,"U","N",,,"I219",211,59,,21,1,1,1,"I219",,,,,,,,,,,,,,,,,,,,,,,,,,,,,,,,,,,,,,,,,,,,,,,,,,,,,,,,,,1,"I219",,,,,,,,,,,,,,,,,,,,8,,,2,4,998,9
2,99,,2,3,"M",1084,,42,22,10,,3,"W",5,2014,"U",,"U","N",,,"C61",113,33,,11,1,1,1,"C61",,,,,,,,,,,,,,,,,,,,,,,,,,,,,,,,,,,,,,,,,,,,,,,,,,,,,,,,,,1,"C61",,,,,,,,,,,,,,,,,,,,8,,,2,4,998,9
2,99,,2,3,"M",1079,,41,21,10,,1,"S",7,2014,"U",,"U","N",,,"J441",267,86,,28,9,1,1,"R688",2,1,"A419",3,1,"J189",6,1,"J441",6,2,"J449",6,3,"I279",6,4,"I64",6,5,"I639",6,6,"I259",,,,,,,,,,,,,,,,,,,,,,,,,,,,,,,,,,7,"J441","A419","I259","I279","I639","J440","R688",,,,,,,,,,,,,,8,,,2,4,998,9
2,99,,2,3,"F",1053,,36,16,7,,3,"S",3,2014,"U",,"U","N",,,"R99",379,110,,36,1,1,1,"R99",,,,,,,,,,,,,,,,,,,,,,,,,,,,,,,,,,,,,,,,,,,,,,,,,,,,,,,,,,1,"R99",,,,,,,,,,,,,,,,,,,,8,,,2,4,998,9
2,99,,2,3,"F",1058,,37,17,8,,1,"M",4,2014,"U",,"U","N",,,"C56",109,32,,10,2,1,1,"C56",2,1,"C56",,,,,,,,,,,,,,,,,,,,,,,,,,,,,,,,,,,,,,,,,,,,,,,,,,,,,,,1,"C56",,,,,,,,,,,,,,,,,,,,8,,,2,4,998,9
2,99,,2,3,"M",1052,,36,16,7,,3,"M",5,2014,"U",,"U","U",,,"M109",313,111,,37,4,1,1,"I499",2,1,"I517",2,2,"I10",3,1,"M109",,,,,,,,,,,,,,,,,,,,,,,,,,,,,,,,,,,,,,,,,,,,,,,,,4,"M109","I10","I499","I517",,,,,,,,,,,,,,,,,8,,,2,4,998,9
2,99,,2,3,"F",1046,,35,15,7,,1,"M",5,2014,"U",,"U","N",,,"J449",267,86,,28,6,1,1,"I469",2,1,"A419",3,1,"I279",4,1,"J449",6,1,"D45",6,2,"R688",,,,,,,,,,,,,,,,,,,,,,,,,,,,,,,,,,,,,,,,,,,6,"J449","A419","D45","I279","I469","R688",,,,,,,,,,,,,,,8,,,2,4,998,9
2,99,,2,3,"F",1084,,42,22,10,,3,"W",5,2014,"U",,"U","N",,,"I64",238,70,,24,5,1,1,"I499",2,1,"I64",2,2,"R53",3,1,"F03",6,1,"R54",,,,,,,,,,,,,,,,,,,,,,,,,,,,,,,,,,,,,,,,,,,,,,5,"I64","F03","I499","R53","R54",,,,,,,,,,,,,,,,8,,,2,4,998,9
2,99,,2,3,"F",1067,,39,19,9,,1,"W",7,2014,"U",,"U","N",,,"I259",215,63,,21,5,1,1,"R570",2,1,"I517",3,1,"I259",6,1,"E149",6,2,"I10",,,,,,,,,,,,,,,,,,,,,,,,,,,,,,,,,,,,,,,,,,,,,,5,"I259","E149","I10","I517","R570",,,,,,,,,,,,,,,,8,,,2,4,998,9
2,99,,2,3,"F",1062,,38,18,8,,3,"W",7,2014,"U",,"U","N",,,"I219",211,59,,21,4,1,1,"I219",2,1,"I517",3,1,"I500",4,1,"I10",,,,,,,,,,,,,,,,,,,,,,,,,,,,,,,,,,,,,,,,,,,,,,,,,4,"I219","I10","I500","I517",,,,,,,,,,,,,,,,,8,,,2,4,998,9
2,99,,2,4,"F",1078,,41,21,10,,3,"M",3,2014,"U",,"U","N",,,"F069",176,111,,37,2,1,1,"A419",2,1,"F069",,,,,,,,,,,,,,,,,,,,,,,,,,,,,,,,,,,,,,,,,,,,,,,,,,,,,,,2,"F069","A419",,,,,,,,,,,,,,,,,,,8,,,2,4,998,9
2,99,,2,4,"M",1073,,40,20,9,,3,"M",4,2014,"U",,"U","N",,,"C349",93,27,,8,2,1,1,"R092",2,1,"C349",,,,,,,,,,,,,,,,,,,,,,,,,,,,,,,,,,,,,,,,,,,,,,,,,,,,,,,2,"C349","R092",,,,,,,,,,,,,,,,,,,8,,,2,4,998,9
2,99,,2,4,"M",1058,,37,17,8,,3,"M",7,2014,"U",,"U","N",,,"I219",211,59,,21,5,1,1,"I219",2,1,"I500",2,2,"I10",3,1,"N185",6,1,"L031",,,,,,,,,,,,,,,,,,,,,,,,,,,,,,,,,,,,,,,,,,,,,,4,"I219","I120","I500","L031",,,,,,,,,,,,,,,,,8,,,2,4,998,9
2,99,,2,4,"M",1054,,36,16,7,,3,"M",7,2014,"U",,"U","U",,,"C229",85,24,,15,7,1,1,"C229",1,2,"C80",2,1,"K746",2,2,"B169",3,1,"K297",3,2,"K279",4,1,"B169",,,,,,,,,,,,,,,,,,,,,,,,,,,,,,,,,,,,,,,,5,"C229","B169","K279","K297","K746",,,,,,,,,,,,,,,,8,,,2,4,998,9
2,99,,2,4,"M",1080,,42,22,10,,3,"M",1,2014,"U",,"U","N",,,"E149",159,46,,16,6,1,1,"I219",2,1,"E162",3,1,"E149",3,2,"K922",6,1,"D696",6,2,"K769",,,,,,,,,,,,,,,,,,,,,,,,,,,,,,,,,,,,,,,,,,,6,"E149","D696","E162","I219","K769","K922",,,,,,,,,,,,,,,8,,,2,4,998,9
4,99,,2,4,"F",1023,,30,10,4,,1,"S",2,2014,"U",,"U","N",,,"M321",312,111,,37,3,1,1,"I499",2,1,"M329",3,1,"R688",,,,,,,,,,,,,,,,,,,,,,,,,,,,,,,,,,,,,,,,,,,,,,,,,,,,2,"M321","R688",,,,,,,,,,,,,,,,,,,8,,,2,4,998,9
2,99,,2,4,"M",5011,,2,1,1,2,1,"S",3,2014,"U",,"U","N",,,"P073",358,108,90,33,2,1,1,"P285",2,1,"P073",,,,,,,,,,,,,,,,,,,,,,,,,,,,,,,,,,,,,,,,,,,,,,,,,,,,,,,2,"P073","P285",,,,,,,,,,,,,,,,,,,8,,,2,4,998,9
2,99,,2,4,"M",1036,,33,13,6,,1,"S",4,2014,"U",,"U","N",,,"I619",236,70,,24,5,1,1,"I678",2,1,"I619",3,1,"I10",6,1,"A419",6,2,"R688",,,,,,,,,,,,,,,,,,,,,,,,,,,,,,,,,,,,,,,,,,,,,,5,"I619","A419","I10","I678","R688",,,,,,,,,,,,,,,,8,,,2,4,998,9
2,99,,2,4,"M",1083,,42,22,10,,1,"M",4,2014,"U",,"U","N",,,"C349",93,27,,8,3,1,1,"C349",2,1,"J189",3,1,"I10",,,,,,,,,,,,,,,,,,,,,,,,,,,,,,,,,,,,,,,,,,,,,,,,,,,,3,"C349","I10","J189",,,,,,,,,,,,,,,,,,8,,,2,4,998,9
2,99,,2,4,"F",1088,,43,23,11,,1,"W",4,2014,"U",,"U","N",,,"E889",173,111,,37,5,1,1,"J690",2,1,"A419",3,1,"E889",6,1,"N19",6,2,"F03",,,,,,,,,,,,,,,,,,,,,,,,,,,,,,,,,,,,,,,,,,,,,,5,"E889","A419","F03","J690","N19",,,,,,,,,,,,,,,,8,,,2,4,998,9
2,99,,2,4,"F",1081,,42,22,10,,1,"W",5,2014,"U",,"U","N",,,"C414",96,43,,15,5,1,1,"C414",1,2,"C80",2,1,"E149",3,1,"I10",6,1,"I48",,,,,,,,,,,,,,,,,,,,,,,,,,,,,,,,,,,,,,,,,,,,,,4,"C414","E149","I10","I48",,,,,,,,,,,,,,,,,8,,,2,4,998,9
2,99,,2,4,"M",5001,,2,1,1,2,1,"S",4,2014,"U",,"U","N",,,"P072",358,108,89,33,1,1,1,"P072",,,,,,,,,,,,,,,,,,,,,,,,,,,,,,,,,,,,,,,,,,,,,,,,,,,,,,,,,,1,"P072",,,,,,,,,,,,,,,,,,,,8,,,2,4,998,9
2,99,,2,4,"M",1049,,35,15,7,,3,"M",6,2014,"Y",,"U","N",9,,"V892",397,114,,38,2,1,1,"T07",2,1,"V892",,,,,,,,,,,,,,,,,,,,,,,,,,,,,,,,,,,,,,,,,,,,,,,,,,,,,,,2,"V892","T07",,,,,,,,,,,,,,,,,,,8,,,2,4,998,9
2,99,,2,4,"M",1073,,40,20,9,,3,"S",7,2014,"U",,"U","N",,,"I499",228,68,,22,1,1,1,"I499",,,,,,,,,,,,,,,,,,,,,,,,,,,,,,,,,,,,,,,,,,,,,,,,,,,,,,,,,,1,"I499",,,,,,,,,,,,,,,,,,,,8,,,2,4,998,9
2,99,,2,4,"M",1073,,40,20,9,,1,"M",7,2014,"U",,"U","N",,,"J690",273,88,,37,5,1,1,"J690",2,1,"R090",3,1,"R688",6,1,"E149",6,2,"I10",,,,,,,,,,,,,,,,,,,,,,,,,,,,,,,,,,,,,,,,,,,,,,5,"J690","E149","I10","R090","R688",,,,,,,,,,,,,,,,8,,,2,4,998,9
2,99,,2,4,"M",1070,,40,20,9,,1,"M",3,2014,"U",,"U","N",,,"C169",78,22,,5,1,1,1,"C169",,,,,,,,,,,,,,,,,,,,,,,,,,,,,,,,,,,,,,,,,,,,,,,,,,,,,,,,,,1,"C169",,,,,,,,,,,,,,,,,,,,8,,,2,4,998,9
2,99,,2,4,"M",1069,,39,19,9,,1,"M",5,2014,"U",,"U","N",,,"G309",189,52,,17,4,1,1,"J189",6,1,"L984",6,2,"G309",6,3,"I519",,,,,,,,,,,,,,,,,,,,,,,,,,,,,,,,,,,,,,,,,,,,,,,,,4,"G309","I519","J189","L984",,,,,,,,,,,,,,,,,8,,,2,4,998,9
2,99,,2,4,"F",1001,,23,3,2,,3,"S",6,2014,"U",,"U","N",9,,"V892",397,114,,38,2,1,1,"S069",2,1,"V892",,,,,,,,,,,,,,,,,,,,,,,,,,,,,,,,,,,,,,,,,,,,,,,,,,,,,,,2,"V892","S069",,,,,,,,,,,,,,,,,,,8,,,2,4,998,9
2,99,,2,4,"F",1099,,45,25,11,,3,"W",7,2014,"U",,"U","N",,,"R54",376,110,,36,1,2,1,"R54",,,,,,,,,,,,,,,,,,,,,,,,,,,,,,,,,,,,,,,,,,,,,,,,,,,,,,,,,,1,"R54",,,,,,,,,,,,,,,,,,,,8,,,2,4,998,9
2,99,,2,4,"F",1051,,36,16,7,,1,"M",1,2014,"U",,"U","N",,,"C56",109,32,,10,2,1,1,"C56",1,2,"C780",,,,,,,,,,,,,,,,,,,,,,,,,,,,,,,,,,,,,,,,,,,,,,,,,,,,,,,2,"C56","C780",,,,,,,,,,,,,,,,,,,8,,,2,4,998,9
2,99,,2,4,"F",1052,,36,16,7,,3,"M",2,2014,"U",,"U","N",,,"E141",159,46,,16,3,1,1,"I219",2,1,"A419",3,1,"E141",,,,,,,,,,,,,,,,,,,,,,,,,,,,,,,,,,,,,,,,,,,,,,,,,,,,3,"E141","A419","I219",,,,,,,,,,,,,,,,,,8,,,2,4,998,9
2,99,,2,4,"F",4010,,9,1,1,9,1,"S",3,2014,"U",,"U","N",,,"P240",362,108,99,33,3,1,1,"R688",2,1,"P239",3,1,"P240",,,,,,,,,,,,,,,,,,,,,,,,,,,,,,,,,,,,,,,,,,,,,,,,,,,,3,"P240","P239","R688",,,,,,,,,,,,,,,,,,8,,,2,4,998,9
2,99,,2,4,"M",1071,,40,20,9,,3,"S",5,2014,"U",,"U","N",,,"I10",206,69,,23,4,1,1,"J189",2,1,"E86",3,1,"I10",3,2,"E149",,,,,,,,,,,,,,,,,,,,,,,,,,,,,,,,,,,,,,,,,,,,,,,,,4,"I10","E149","E86","J189",,,,,,,,,,,,,,,,,8,,,2,4,998,9
2,99,,2,4,"M",5002,,2,1,1,2,1,"S",6,2014,"U",,"U","N",,,"P012",357,108,78,33,2,1,1,"Q336",2,1,"P012",,,,,,,,,,,,,,,,,,,,,,,,,,,,,,,,,,,,,,,,,,,,,,,,,,,,,,,2,"P012","Q336",,,,,,,,,,,,,,,,,,,8,,,2,4,998,9
2,99,,2,5,"M",1034,,32,12,5,,3,"S",5,2014,"U",,"U","N",,,"N19",327,100,,31,7,1,1,"I500",2,1,"I420",3,1,"I10",3,2,"F179",4,1,"N19",6,1,"K761",6,2,"E668",,,,,,,,,,,,,,,,,,,,,,,,,,,,,,,,,,,,,,,,6,"N19","E668","F179","I119","I500","K761",,,,,,,,,,,,,,,8,,,2,4,998,9
2,99,,2,5,"M",1062,,38,18,8,,3,"M",5,2014,"U",,"U","N",,,"I219",211,59,,21,3,1,1,"T782",2,1,"I219",6,1,"Y579",,,,,,,,,,,,,,,,,,,,,,,,,,,,,,,,,,,,,,,,,,,,,,,,,,,,3,"I219","T782","Y579",,,,,,,,,,,,,,,,,,8,,,2,4,998,9
2,99,,2,5,"M",1053,,36,16,7,,3,"S",6,2014,"U",,"U","N",,,"B948",68,18,,37,7,1,1,"N19",2,1,"N19",3,1,"B948",6,1,"E149",6,2,"I10",6,3,"N19",6,4,"E668",,,,,,,,,,,,,,,,,,,,,,,,,,,,,,,,,,,,,,,,5,"B948","E142","E668","I120","N19",,,,,,,,,,,,,,,,8,,,2,4,998,9
2,99,,2,5,"F",1086,,43,23,11,,1,"W",2,2014,"U",,"U","N",,,"L984",309,111,,37,9,1,1,"A419",2,1,"L984",6,1,"K922",6,2,"I619",6,3,"E46",6,4,"E86",6,5,"N189",6,6,"R18",6,7,"J90",,,,,,,,,,,,,,,,,,,,,,,,,,,,,,,,,,9,"L984","A419","E46","E86","I619","J90","K922","N189","R18",,,,,,,,,,,,8,,,2,4,998,9
2,99,,2,5,"M",1054,,36,16,7,,3,"M",2,2014,"U",,"U","N",,,"G122",194,111,,37,4,1,1,"J189",2,1,"G122",3,1,"E149",6,1,"D649",,,,,,,,,,,,,,,,,,,,,,,,,,,,,,,,,,,,,,,,,,,,,,,,,4,"G122","D649","E149","J189",,,,,,,,,,,,,,,,,8,,,2,4,998,9
2,99,,2,5,"M",1059,,37,17,8,,3,"M",3,2014,"U",1,"U","N",,,"E145",159,46,,16,7,1,1,"A419",2,1,"L984",2,2,"L899",3,1,"E149",4,1,"M545",4,2,"M199",6,1,"A169",,,,,,,,,,,,,,,,,,,,,,,,,,,,,,,,,,,,,,,,6,"E145","A169","A419","L899","M199","M545",,,,,,,,,,,,,,,8,,,2,4,998,9
2,99,,2,5,"F",1055,,37,17,8,,3,"W",3,2014,"U",1,"U","N",,,"E149",159,46,,16,3,1,1,"I219",2,1,"E149",3,1,"E149",,,,,,,,,,,,,,,,,,,,,,,,,,,,,,,,,,,,,,,,,,,,,,,,,,,,2,"E149","I219",,,,,,,,,,,,,,,,,,,8,,,2,4,998,9
2,99,,2,5,"F",1084,,42,22,10,,1,"W",4,2014,"U",1,"U","N",,,"N189",327,100,,31,4,1,1,"A419",2,1,"D649",3,1,"N189",6,1,"R630",,,,,,,,,,,,,,,,,,,,,,,,,,,,,,,,,,,,,,,,,,,,,,,,,4,"N189","A419","D649","R630",,,,,,,,,,,,,,,,,8,,,2,4,998,9
2,99,,2,5,"M",1034,,32,12,5,,1,"S",4,2014,"U",1,"U","N",,,"J690",273,88,,37,3,1,1,"J969",2,1,"J690",6,1,"G809",,,,,,,,,,,,,,,,,,,,,,,,,,,,,,,,,,,,,,,,,,,,,,,,,,,,3,"J690","G809","J969",,,,,,,,,,,,,,,,,,8,,,2,4,998,9
2,99,,2,5,"F",1073,,40,20,9,,1,"M",4,2014,"U",1,"U","N",,,"E142",159,46,,16,7,1,1,"I269",2,1,"N185",3,1,"E149",3,2,"I10",6,1,"I500",6,2,"E785",6,3,"D649",,,,,,,,,,,,,,,,,,,,,,,,,,,,,,,,,,,,,,,,6,"E142","D649","E785","I10","I269","I500",,,,,,,,,,,,,,,8,,,2,4,998,9
2,99,,2,5,"F",1088,,43,23,11,,1,"W",5,2014,"U",,"U","N",,,"J441",267,86,,28,4,1,1,"J960",2,1,"J189",2,2,"J441",2,3,"J449",,,,,,,,,,,,,,,,,,,,,,,,,,,,,,,,,,,,,,,,,,,,,,,,,3,"J441","J440","J960",,,,,,,,,,,,,,,,,,8,,,2,4,998,9
2,99,,2,5,"M",1072,,40,20,9,,1,"M",6,2014,"U",,"U","N",,,"I219",211,59,,21,4,1,1,"R570",2,1,"I219",6,1,"I10",6,2,"F171",,,,,,,,,,,,,,,,,,,,,,,,,,,,,,,,,,,,,,,,,,,,,,,,,4,"I219","F171","I10","R570",,,,,,,,,,,,,,,,,1,,,1,1,998,9