"restatus","educ1989","educ2003","educflag","monthdth","sex","age","ageflag","ager52","ager27","ager12","ager22","placdth","marstat","weekday","year","injwork","mandeath","methdisp","autopsy","activity","injury","ucod","ucr358","ucr113","ucr130","ucr39","eanum","econdp_1","econds_1","enicon_1","econdp_2","econds_2","enicon_2","econdp_3","econds_3","enicon_3","econdp_4","econds_4","enicon_4","econdp_5","econds_5","enicon_5","econdp_6","econds_6","enicon_6","econdp_7","econds_7","enicon_7","econdp_8","econds_8","enicon_8","econdp_9","econds_9","enicon_9","econdp_10","econds_10","enicon_10","econdp_11","econds_11","enicon_11","econdp_12","econds_12","enicon_12","econdp_13","econds_13","enicon_13","econdp_14","econds_14","enicon_14","econdp_15","econds_15","enicon_15","econdp_16","econds_16","enicon_16","econdp_17","econds_17","enicon_17","econdp_18","econds_18","enicon_18","econdp_19","econds_19","enicon_19","econdp_20","econds_20","enicon_20","ranum","record_1","record_2","record_3","record_4","record_5","record_6","record_7","record_8","record_9","record_10","record_11","record_12","record_13","record_14","record_15","record_16","record_17","record_18","record_19","record_20","race","brace","raceimp","racer3","racer5","hispanic","hspanicr"
1,99,,2,1,"F",1034,,32,12,5,,2,"S",4,2013,"U",,"U","N",,,"R298",380,110,,36,2,1,1,"R060",2,1,"R298",,,,,,,,,,,,,,,,,,,,,,,,,,,,,,,,,,,,,,,,,,,,,,,,,,,,,,,2,"R298","R060",,,,,,,,,,,,,,,,,,,8,,,2,4,998,9
1,99,,2,1,"F",1032,,32,12,5,,3,"S",4,2013,"U",,"U","N",,,"O159",347,107,,32,1,1,1,"O159",,,,,,,,,,,,,,,,,,,,,,,,,,,,,,,,,,,,,,,,,,,,,,,,,,,,,,,,,,1,"O159",,,,,,,,,,,,,,,,,,,,8,,,2,4,998,9
1,99,,2,1,"F",1067,,39,19,9,,3,"M",6,2013,"U",,"U","N",,,"E142",159,46,,16,4,1,1,"I219",2,1,"I10",3,1,"E149",3,2,"N189",,,,,,,,,,,,,,,,,,,,,,,,,,,,,,,,,,,,,,,,,,,,,,,,,4,"E142","E149","I120","I219",,,,,,,,,,,,,,,,,8,,,2,4,998,9
1,99,,2,1,"F",1091,,44,24,11,,3,"W",7,2013,"U",,"U","N",,,"I110",207,56,,20,5,1,1,"A419",2,1,"I500",2,2,"I517",3,1,"I48",4,1,"I10",,,,,,,,,,,,,,,,,,,,,,,,,,,,,,,,,,,,,,,,,,,,,,6,"I110","A419","I10","I48","I500","I517",,,,,,,,,,,,,,,8,,,2,4,998,9
1,99,,2,1,"M",1023,,30,10,4,,3,"S",4,2013,"U",,"U","N",9,9,"W76",411,123,,39,4,1,1,"T71",1,2,"W76",2,1,"T71",3,1,"T71",,,,,,,,,,,,,,,,,,,,,,,,,,,,,,,,,,,,,,,,,,,,,,,,,2,"W76","T71",,,,,,,,,,,,,,,,,,,8,,,2,4,998,9
1,99,,2,1,"F",1052,,36,16,7,,3,"S",4,2013,"U",,"U","N",9,9,"W80",410,123,,39,3,1,1,"R568",1,2,"T179",1,3,"W80",,,,,,,,,,,,,,,,,,,,,,,,,,,,,,,,,,,,,,,,,,,,,,,,,,,,3,"W80","R568","T179",,,,,,,,,,,,,,,,,,8,,,2,4,998,9
1,99,,2,1,"M",1049,,35,15,7,,3,"M",3,2013,"U",,"U","N",,,"L97",309,111,,37,3,1,1,"I499",2,1,"A419",3,1,"L97",,,,,,,,,,,,,,,,,,,,,,,,,,,,,,,,,,,,,,,,,,,,,,,,,,,,3,"L97","A419","I499",,,,,,,,,,,,,,,,,,8,,,2,4,998,9
1,99,,2,1,"M",1039,,33,13,6,,3,"M",7,2013,"U",,"U","N",,,"L031",308,111,,37,7,1,1,"I219",2,1,"I64",3,1,"A419",4,1,"L031",6,1,"E149",6,2,"I10",6,3,"G473",,,,,,,,,,,,,,,,,,,,,,,,,,,,,,,,,,,,,,,,7,"L031","A419","E149","G473","I10","I219","I64",,,,,,,,,,,,,,8,,,2,4,998,9
1,99,,2,1,"F",1037,,33,13,6,,1,"M",7,2013,"U",,"U","N",,,"J449",267,86,,28,8,1,1,"A419",2,1,"L031",3,1,"J449",6,1,"E872",6,2,"I517",6,3,"I500",6,4,"G473",6,5,"E668",,,,,,,,,,,,,,,,,,,,,,,,,,,,,,,,,,,,,8,"J449","A419","E668","E872","G473","I500","I517","L031",,,,,,,,,,,,,8,,,2,4,998,9
1,99,,2,1,"F",1045,,35,15,7,,1,"M",7,2013,"U",,"U","N",,,"C169",78,22,,5,2,1,1,"C169",2,1,"D539",,,,,,,,,,,,,,,,,,,,,,,,,,,,,,,,,,,,,,,,,,,,,,,,,,,,,,,2,"C169","D539",,,,,,,,,,,,,,,,,,,8,,,2,4,998,9
1,99,,2,1,"M",1078,,41,21,10,,3,"M",1,2013,"U",,"U","N",,9,"K319",289,111,,37,6,1,1,"I499",2,1,"T179",2,2,"W80",3,1,"T818",3,2,"Y836",3,3,"K319",,,,,,,,,,,,,,,,,,,,,,,,,,,,,,,,,,,,,,,,,,,6,"K319","I499","T179","T818","W80","Y836",,,,,,,,,,,,,,,8,,,2,4,998,9
1,99,,2,1,"F",1060,,38,18,8,,3,"M",2,2013,"U",,"U","N",,,"C509",104,29,,9,3,1,1,"C509",2,1,"C798",2,2,"C80",,,,,,,,,,,,,,,,,,,,,,,,,,,,,,,,,,,,,,,,,,,,,,,,,,,,2,"C509","C798",,,,,,,,,,,,,,,,,,,8,,,2,4,998,9
1,99,,2,1,"F",1072,,40,20,9,,1,"S",3,2013,"U",,"U","N",,,"I48",228,68,,22,4,1,1,"R579",2,1,"A419",2,2,"J111",3,1,"I48",,,,,,,,,,,,,,,,,,,,,,,,,,,,,,,,,,,,,,,,,,,,,,,,,4,"I48","A419","J111","R579",,,,,,,,,,,,,,,,,8,,,2,4,998,9
1,99,,2,1,"F",1074,,40,20,9,,1,"W",5,2013,"U",,"U","N",,,"K319",289,111,,37,7,1,1,"A419",2,1,"J958",2,2,"T814",6,1,"I500",6,2,"E46",6,3,"Y834",6,4,"K319",,,,,,,,,,,,,,,,,,,,,,,,,,,,,,,,,,,,,,,,7,"K319","A419","E46","I500","J958","T814","Y834",,,,,,,,,,,,,,8,,,2,4,998,9
1,99,,2,1,"F",1064,,38,18,8,,3,"M",5,2013,"U",,"U","N",,,"E119",159,46,,16,4,1,1,"I219",2,1,"E119",3,1,"I10",6,1,"E785",,,,,,,,,,,,,,,,,,,,,,,,,,,,,,,,,,,,,,,,,,,,,,,,,4,"E119","E785","I10","I219",,,,,,,,,,,,,,,,,8,,,2,4,998,9
1,99,,2,1,"F",1059,,37,17,8,,1,"M",5,2013,"U",,"U","N",,,"J189",257,78,,27,3,1,1,"J189",6,1,"E149",6,2,"I10",,,,,,,,,,,,,,,,,,,,,,,,,,,,,,,,,,,,,,,,,,,,,,,,,,,,3,"J189","E149","I10",,,,,,,,,,,,,,,,,,8,,,2,4,998,9
1,99,,2,1,"F",1078,,41,21,10,,1,"W",6,2013,"U",,"U","N",,,"L899",309,111,,37,2,1,1,"A419",2,1,"L899",,,,,,,,,,,,,,,,,,,,,,,,,,,,,,,,,,,,,,,,,,,,,,,,,,,,,,,2,"L899","A419",,,,,,,,,,,,,,,,,,,8,,,2,4,998,9
1,99,,2,1,"M",1042,,34,14,6,,1,"S",6,2013,"U",,"U","U",,,"E149",159,46,,16,5,1,1,"I500",2,1,"A419",3,1,"J189",4,1,"E149",6,1,"K922",,,,,,,,,,,,,,,,,,,,,,,,,,,,,,,,,,,,,,,,,,,,,,5,"E149","A419","I500","J189","K922",,,,,,,,,,,,,,,,8,,,2,4,998,9
1,99,,2,1,"F",1060,,38,18,8,,3,"M",1,2013,"U",,"U","N",,,"E142",159,46,,16,4,1,1,"I219",2,1,"I10",3,1,"E149",6,1,"N189",,,,,,,,,,,,,,,,,,,,,,,,,,,,,,,,,,,,,,,,,,,,,,,,,4,"E142","E149","I120","I219",,,,,,,,,,,,,,,,,8,,,2,4,998,9
1,99,,2,1,"F",1075,,41,21,10,,3,"W",2,2013,"U",,"U","N",,,"I10",206,69,,23,4,1,1,"I499",2,1,"I713",3,1,"I10",6,1,"I48",,,,,,,,,,,,,,,,,,,,,,,,,,,,,,,,,,,,,,,,,,,,,,,,,3,"I10","I48","I713",,,,,,,,,,,,,,,,,,8,,,2,4,998,9
1,99,,2,1,"M",1057,,37,17,8,,1,"M",6,2013,"U",,"U","N",,,"A419",23,10,,37,4,1,1,"A419",6,1,"N189",6,2,"M109",6,3,"E872",,,,,,,,,,,,,,,,,,,,,,,,,,,,,,,,,,,,,,,,,,,,,,,,,4,"A419","E872","M109","N189",,,,,,,,,,,,,,,,,8,,,2,4,998,9
1,99,,2,1,"F",1071,,40,20,9,,1,"M",6,2013,"U",,"U","N",,,"C509",104,29,,9,4,1,1,"C509",1,2,"C80",6,1,"E149",6,2,"I10",,,,,,,,,,,,,,,,,,,,,,,,,,,,,,,,,,,,,,,,,,,,,,,,,3,"C509","E149","I10",,,,,,,,,,,,,,,,,,8,,,2,4,998,9
1,99,,2,1,"M",1060,,38,18,8,,3,"M",2,2013,"U",,"U","N",,,"N185",327,100,,31,4,1,1,"I269",2,1,"T817",6,1,"N185",6,2,"Y841",,,,,,,,,,,,,,,,,,,,,,,,,,,,,,,,,,,,,,,,,,,,,,,,,4,"N185","I269","T817","Y841",,,,,,,,,,,,,,,,,8,,,2,4,998,9
1,99,,2,1,"M",1076,,41,21,10,,3,"M",2,2013,"U",,"U","N",,,"F107",178,111,,37,8,1,1,"A419",2,1,"L899",3,1,"R263",6,1,"F03",6,2,"F179",6,3,"F109",6,4,"K922",6,5,"D649",,,,,,,,,,,,,,,,,,,,,,,,,,,,,,,,,,,,,7,"F107","A419","D649","F179","K922","L899","R263",,,,,,,,,,,,,,8,,,2,4,998,9
1,99,,2,1,"M",1055,,37,17,8,,3,"M",4,2013,"U",4,"U","Y",,,"I219",211,59,,21,2,1,1,"I250",6,1,"I219",,,,,,,,,,,,,,,,,,,,,,,,,,,,,,,,,,,,,,,,,,,,,,,,,,,,,,,2,"I219","I250",,,,,,,,,,,,,,,,,,,8,,,2,4,998,9
1,99,,2,2,"F",1072,,40,20,9,,3,"M",6,2013,"U",,"U","N",,,"E162",163,111,,37,5,1,1,"K922",2,1,"E46",3,1,"E162",6,1,"B99",6,2,"M009",,,,,,,,,,,,,,,,,,,,,,,,,,,,,,,,,,,,,,,,,,,,,,5,"E162","B99","E46","K922","M009",,,,,,,,,,,,,,,,8,,,2,4,998,9
1,99,,2,2,"M",1056,,37,17,8,,1,"M",6,2013,"U",,"U","N",,,"K403",291,92,,37,5,1,1,"E872",2,1,"K632",3,1,"K403",4,1,"J189",6,1,"K254",,,,,,,,,,,,,,,,,,,,,,,,,,,,,,,,,,,,,,,,,,,,,,5,"K403","E872","J189","K254","K632",,,,,,,,,,,,,,,,8,,,2,4,998,9
1,99,,2,2,"F",1085,,43,23,11,,2,"W",7,2013,"U",,"U","N",,,"I609",235,70,,24,4,1,1,"I64",1,2,"I609",2,1,"I714",3,1,"I10",,,,,,,,,,,,,,,,,,,,,,,,,,,,,,,,,,,,,,,,,,,,,,,,,3,"I609","I10","I714",,,,,,,,,,,,,,,,,,8,,,2,4,998,9
1,99,,2,2,"M",1074,,40,20,9,,3,"M",7,2013,"U",,"U","N",,,"K922",306,111,,37,7,1,1,"A419",1,2,"L899",1,3,"N390",2,1,"D649",3,1,"K922",6,1,"I10",6,2,"E119",,,,,,,,,,,,,,,,,,,,,,,,,,,,,,,,,,,,,,,,7,"K922","A419","D649","E119","I10","L899","N390",,,,,,,,,,,,,,8,,,2,4,998,9
1,99,,2,2,"M",1062,,38,18,8,,1,"M",2,2013,"U",,"U","N",,,"C23",87,43,,15,5,1,1,"A419",2,1,"E86",2,2,"E46",3,1,"C23",6,1,"E149",,,,,,,,,,,,,,,,,,,,,,,,,,,,,,,,,,,,,,,,,,,,,,5,"C23","A419","E149","E46","E86",,,,,,,,,,,,,,,,8,,,2,4,998,9
1,99,,2,2,"F",1072,,40,20,9,,1,"W",2,2013,"U",,"U","N",,,"D320",143,44,,37,2,1,1,"D320",6,1,"E46",,,,,,,,,,,,,,,,,,,,,,,,,,,,,,,,,,,,,,,,,,,,,,,,,,,,,,,2,"D320","E46",,,,,,,,,,,,,,,,,,,8,,,2,4,998,9
1,99,,2,2,"M",1066,,39,19,9,,1,"M",2,2013,"U",,"U","N",,,"J449",267,86,,28,4,1,1,"I469",6,1,"J449",6,2,"E149",6,3,"N185",,,,,,,,,,,,,,,,,,,,,,,,,,,,,,,,,,,,,,,,,,,,,,,,,3,"J449","E142","I469",,,,,,,,,,,,,,,,,,8,,,2,4,998,9
1,99,,2,2,"F",1056,,37,17,8,,3,"W",2,2013,"U",,"U","N",,,"I714",242,73,,26,1,1,1,"I714",,,,,,,,,,,,,,,,,,,,,,,,,,,,,,,,,,,,,,,,,,,,,,,,,,,,,,,,,,1,"I714",,,,,,,,,,,,,,,,,,,,8,,,2,4,998,9
1,99,,2,2,"F",1051,,36,16,7,,1,"M",3,2013,"U",,"U","N",,,"C509",104,29,,9,4,1,1,"C509",6,1,"D649",6,2,"M844",6,3,"E790",,,,,,,,,,,,,,,,,,,,,,,,,,,,,,,,,,,,,,,,,,,,,,,,,4,"C509","D649","E790","M844",,,,,,,,,,,,,,,,,8,,,2,4,998,9
1,99,,2,2,"M",1025,,31,11,5,,1,"S",5,2013,"U",,"U","N",,,"J320",261,89,,37,3,1,1,"G060",2,1,"J320",2,2,"J322",,,,,,,,,,,,,,,,,,,,,,,,,,,,,,,,,,,,,,,,,,,,,,,,,,,,3,"J320","G060","J322",,,,,,,,,,,,,,,,,,8,,,2,4,998,9
1,99,,2,2,"M",1056,,37,17,8,,1,"M",6,2013,"U",,"U","N",,,"C259",88,25,,7,1,1,1,"C259",,,,,,,,,,,,,,,,,,,,,,,,,,,,,,,,,,,,,,,,,,,,,,,,,,,,,,,,,,1,"C259",,,,,,,,,,,,,,,,,,,,8,,,2,4,998,9
1,99,,2,2,"F",1046,,35,15,7,,3,"M",7,2013,"U",,"U","N",,,"I219",211,59,,21,2,1,1,"I219",1,2,"I269",,,,,,,,,,,,,,,,,,,,,,,,,,,,,,,,,,,,,,,,,,,,,,,,,,,,,,,2,"I219","I269",,,,,,,,,,,,,,,,,,,8,,,2,4,998,9
1,99,,2,2,"F",1051,,36,16,7,,3,"S",7,2013,"U",,"U","N",,,"I64",238,70,,24,8,1,1,"I219",2,1,"I64",3,1,"R568",6,1,"I10",6,2,"E149",6,3,"I259",6,4,"I500",6,5,"I429",,,,,,,,,,,,,,,,,,,,,,,,,,,,,,,,,,,,,8,"I64","E149","I10","I219","I259","I429","I500","R568",,,,,,,,,,,,,8,,,2,4,998,9
1,99,,2,2,"F",1034,,32,12,5,,3,"M",1,2013,"U",,"U","N",,,"I120",208,69,,23,5,1,1,"N185",2,1,"I10",3,1,"R402",4,1,"I469",6,1,"I516",,,,,,,,,,,,,,,,,,,,,,,,,,,,,,,,,,,,,,,,,,,,,,4,"I120","I469","I516","R402",,,,,,,,,,,,,,,,,8,,,2,4,998,9
1,99,,2,2,"M",1067,,39,19,9,,1,"M",1,2013,"U",,"U","U",,,"L031",308,111,,37,6,1,1,"A419",2,1,"A419",3,1,"L031",6,1,"E149",6,2,"I10",6,3,"I500",,,,,,,,,,,,,,,,,,,,,,,,,,,,,,,,,,,,,,,,,,,5,"L031","A419","E149","I10","I500",,,,,,,,,,,,,,,,8,,,2,4,998,9
1,99,,2,2,"M",4002,,4,1,1,4,1,"S",3,2013,"U",,"U","N",,,"P240",362,108,99,33,1,1,1,"P240",,,,,,,,,,,,,,,,,,,,,,,,,,,,,,,,,,,,,,,,,,,,,,,,,,,,,,,,,,1,"P240",,,,,,,,,,,,,,,,,,,,8,,,2,4,998,9
1,99,,2,2,"M",1051,,36,16,7,,1,"S",4,2013,"U",,"U","N",,,"L031",308,111,,37,6,1,1,"A419",2,1,"A419",3,1,"L031",6,1,"M100",6,2,"E119",6,3,"I10",,,,,,,,,,,,,,,,,,,,,,,,,,,,,,,,,,,,,,,,,,,5,"L031","A419","E119","I10","M100",,,,,,,,,,,,,,,,8,,,2,4,998,9
1,99,,2,2,"F",1075,,41,21,10,,1,"W",4,2013,"U",,"U","N",9,9,"X599",423,123,,39,5,1,1,"S099",1,2,"I629",2,1,"I500",3,1,"E149",6,1,"X599",,,,,,,,,,,,,,,,,,,,,,,,,,,,,,,,,,,,,,,,,,,,,,5,"X599","E149","I500","I629","S099",,,,,,,,,,,,,,,,8,,,2,4,998,9
1,99,,2,2,"M",1058,,37,17,8,,3,"W",4,2013,"U",,"U","N",,,"I499",228,68,,22,1,1,1,"I499",,,,,,,,,,,,,,,,,,,,,,,,,,,,,,,,,,,,,,,,,,,,,,,,,,,,,,,,,,1,"I499",,,,,,,,,,,,,,,,,,,,8,,,2,4,998,9
1,99,,2,2,"M",1049,,35,15,7,,1,"M",2,2013,"U",,"U","N",,,"C349",93,27,,8,3,1,1,"C349",2,1,"J969",3,1,"C349",,,,,,,,,,,,,,,,,,,,,,,,,,,,,,,,,,,,,,,,,,,,,,,,,,,,2,"C349","J969",,,,,,,,,,,,,,,,,,,8,,,2,4,998,9
1,99,,2,2,"F",1059,,37,17,8,,1,"M",2,2013,"U",,"U","N",,,"N185",327,100,,31,6,1,1,"A419",2,1,"A410",3,1,"N185",6,1,"E872",6,2,"D649",6,3,"C959",,,,,,,,,,,,,,,,,,,,,,,,,,,,,,,,,,,,,,,,,,,5,"N185","A410","C959","D649","E872",,,,,,,,,,,,,,,,8,,,2,4,998,9
1,99,,2,2,"M",1071,,40,20,9,,1,"M",3,2013,"U",,"U","N",,,"I429",227,68,,22,5,1,1,"R570",2,1,"J81",3,1,"I429",4,1,"I429",6,1,"I059",,,,,,,,,,,,,,,,,,,,,,,,,,,,,,,,,,,,,,,,,,,,,,4,"I429","I059","J81","R570",,,,,,,,,,,,,,,,,8,,,2,4,998,9
1,99,,2,2,"M",1036,,33,13,6,,2,"D",4,2013,"U",,"U","N",,,"I429",227,68,,22,6,1,1,"I499",2,1,"I429",6,1,"I500",6,2,"J449",6,3,"E149",6,4,"I10",,,,,,,,,,,,,,,,,,,,,,,,,,,,,,,,,,,,,,,,,,,6,"I429","E149","I10","I499","I500","J449",,,,,,,,,,,,,,,8,,,2,4,998,9
1,99,,2,2,"F",1067,,39,19,9,,2,"M",5,2013,"U",,"U","U",,,"I469",228,68,,22,1,1,1,"I469",,,,,,,,,,,,,,,,,,,,,,,,,,,,,,,,,,,,,,,,,,,,,,,,,,,,,,,,,,1,"I469",,,,,,,,,,,,,,,,,,,,8,,,2,4,998,9
1,99,,2,2,"M",1067,,39,19,9,,1,"M",5,2013,"U",,"U","N",,,"J939",278,89,,37,5,1,1,"I519",2,1,"J939",2,2,"I48",3,1,"J969",6,1,"E109",,,,,,,,,,,,,,,,,,,,,,,,,,,,,,,,,,,,,,,,,,,,,,4,"J939","E109","I48","J969",,,,,,,,,,,,,,,,,8,,,2,4,998,9
1,99,,2,2,"M",1045,,35,15,7,,1,"S",7,2013,"U",,"U","N",,,"K122",280,111,,37,3,1,1,"A419",2,1,"K122",3,1,"E149",,,,,,,,,,,,,,,,,,,,,,,,,,,,,,,,,,,,,,,,,,,,,,,,,,,,3,"K122","A419","E149",,,,,,,,,,,,,,,,,,8,,,2,4,998,9
1,99,,2,2,"M",1053,,36,16,7,,3,"S",1,2013,"U",,"U","N",9,9,"W69",409,120,,39,6,1,1,"R570",2,1,"R090",3,1,"T68",3,2,"X31",6,1,"T751",6,2,"W69",,,,,,,,,,,,,,,,,,,,,,,,,,,,,,,,,,,,,,,,,,,6,"W69","R090","R570","T68","T751","X31",,,,,,,,,,,,,,,8,,,2,4,998,9
1,99,,2,2,"F",1067,,39,19,9,,3,"S",2,2013,"U",,"U","N",,,"C509",104,29,,9,2,1,1,"C509",2,1,"C80",,,,,,,,,,,,,,,,,,,,,,,,,,,,,,,,,,,,,,,,,,,,,,,,,,,,,,,1,"C509",,,,,,,,,,,,,,,,,,,,8,,,2,4,998,9
1,99,,2,2,"F",1079,,41,21,10,,1,"M",2,2013,"U",,"U","N",,9,"I64",238,70,,24,7,1,1,"A419",2,1,"J189",2,2,"T179",2,3,"W80",6,1,"I64",6,2,"E149",6,3,"I10",,,,,,,,,,,,,,,,,,,,,,,,,,,,,,,,,,,,,,,,7,"I64","A419","E149","I10","J189","T179","W80",,,,,,,,,,,,,,8,,,2,4,998,9
1,99,,2,2,"F",1073,,40,20,9,,3,"W",3,2013,"U",,"U","N",,,"E119",159,46,,16,4,1,1,"I219",2,1,"E119",3,1,"I10",6,1,"G20",,,,,,,,,,,,,,,,,,,,,,,,,,,,,,,,,,,,,,,,,,,,,,,,,4,"E119","G20","I10","I219",,,,,,,,,,,,,,,,,8,,,2,4,998,9
1,99,,2,2,"M",1034,,32,12,5,,3,"S",3,2013,"U",,"U","N",9,9,"X36",417,123,,39,3,1,1,"S272",2,1,"S280",6,1,"X36",,,,,,,,,,,,,,,,,,,,,,,,,,,,,,,,,,,,,,,,,,,,,,,,,,,,3,"X36","S272","S280",,,,,,,,,,,,,,,,,,8,,,2,4,998,9
1,99,,2,2,"M",1088,,43,23,11,,1,"M",5,2013,"U",,"U","N",,,"E46",167,48,,37,3,1,1,"J969",2,1,"E46",6,1,"I500",,,,,,,,,,,,,,,,,,,,,,,,,,,,,,,,,,,,,,,,,,,,,,,,,,,,3,"E46","I500","J969",,,,,,,,,,,,,,,,,,8,,,2,4,998,9
1,99,,2,2,"M",1069,,39,19,9,,1,"M",5,2013,"U",,"U","N",,,"I48",228,68,,22,6,1,1,"I499",2,1,"I469",3,1,"I500",6,1,"E149",6,2,"I10",6,3,"I48",,,,,,,,,,,,,,,,,,,,,,,,,,,,,,,,,,,,,,,,,,,5,"I48","E149","I10","I469","I500",,,,,,,,,,,,,,,,8,,,2,4,998,9
1,99,,2,3,"M",1055,,37,17,8,,3,"M",6,2013,"U",,"U","U",,,"D432",145,44,,37,4,1,1,"D432",2,1,"I10",3,1,"M109",3,2,"M199",,,,,,,,,,,,,,,,,,,,,,,,,,,,,,,,,,,,,,,,,,,,,,,,,4,"D432","I10","M109","M199",,,,,,,,,,,,,,,,,8,,,2,4,998,9
1,99,,2,3,"M",1065,,39,19,9,,3,"M",7,2013,"U",,"U","U",,,"I120",208,69,,23,5,1,1,"N19",2,1,"D649",3,1,"I10",6,1,"E149",6,2,"E790",,,,,,,,,,,,,,,,,,,,,,,,,,,,,,,,,,,,,,,,,,,,,,4,"I120","D649","E149","E790",,,,,,,,,,,,,,,,,8,,,2,4,998,9
1,99,,2,3,"M",1028,,31,11,5,,1,"M",7,2013,"U",,"U","U",,,"D65",153,111,,37,3,1,1,"D65",3,1,"J189",3,2,"G210",,,,,,,,,,,,,,,,,,,,,,,,,,,,,,,,,,,,,,,,,,,,,,,,,,,,3,"D65","G210","J189",,,,,,,,,,,,,,,,,,8,,,2,4,998,9
1,99,,2,3,"F",1060,,38,18,8,,1,"W",2,2013,"U",,"U","U",,,"J182",257,78,,27,5,1,1,"A419",2,1,"L899",3,1,"J189",6,1,"F99",6,2,"R263",,,,,,,,,,,,,,,,,,,,,,,,,,,,,,,,,,,,,,,,,,,,,,5,"J182","F54","J189","L899","R263",,,,,,,,,,,,,,,,8,,,2,4,998,9
1,99,,2,3,"M",1051,,36,16,7,,3,"D",4,2013,"U",,"U","U",,,"I429",227,68,,22,4,1,1,"I499",2,1,"I429",3,1,"I48",6,1,"I500",,,,,,,,,,,,,,,,,,,,,,,,,,,,,,,,,,,,,,,,,,,,,,,,,3,"I429","I48","I500",,,,,,,,,,,,,,,,,,8,,,2,4,998,9
1,99,,2,3,"F",1051,,36,16,7,,1,"M",6,2013,"U",,"U","U",,,"K922",306,111,,37,7,1,1,"J189",2,1,"A419",3,1,"K922",6,1,"N185",6,2,"E119",6,3,"I10",6,4,"I500",,,,,,,,,,,,,,,,,,,,,,,,,,,,,,,,,,,,,,,,6,"K922","A419","E112","I10","I500","J189",,,,,,,,,,,,,,,8,,,2,4,998,9
1,99,,2,3,"M",1066,,39,19,9,,3,"M",7,2013,"U",,"U","U",,,"E142",159,46,,16,6,1,1,"I10",1,2,"I48",2,1,"E149",2,2,"N189",3,1,"M109",3,2,"E790",,,,,,,,,,,,,,,,,,,,,,,,,,,,,,,,,,,,,,,,,,,6,"E142","E149","E790","I120","I48","M109",,,,,,,,,,,,,,,8,,,2,4,998,9
1,99,,2,3,"F",1038,,33,13,6,,1,"S",7,2013,"U",,"U","U",,,"D649",152,45,,37,4,1,1,"N185",2,1,"E877",3,1,"D649",6,1,"N390",,,,,,,,,,,,,,,,,,,,,,,,,,,,,,,,,,,,,,,,,,,,,,,,,4,"D649","E877","N185","N390",,,,,,,,,,,,,,,,,8,,,2,4,998,9
1,99,,2,3,"F",1084,,42,22,10,,1,"W",7,2013,"U",,"U","U",,,"I64",238,70,,24,4,1,1,"A419",2,1,"L899",6,1,"N390",6,2,"I64",,,,,,,,,,,,,,,,,,,,,,,,,,,,,,,,,,,,,,,,,,,,,,,,,4,"I64","A419","L899","N390",,,,,,,,,,,,,,,,,8,,,2,4,998,9
1,99,,2,3,"M",1071,,40,20,9,,3,"M",1,2013,"U",,"U","U",,,"C349",93,27,,8,5,1,1,"E46",1,2,"R630",1,3,"E878",2,1,"C349",3,1,"I712",,,,,,,,,,,,,,,,,,,,,,,,,,,,,,,,,,,,,,,,,,,,,,5,"C349","E46","E878","I712","R630",,,,,,,,,,,,,,,,8,,,2,4,998,9
1,99,,2,3,"M",1064,,38,18,8,,1,"M",5,2013,"U",,"U","U",,,"I619",236,70,,24,7,1,1,"G935",1,2,"G936",2,1,"I64",2,2,"I619",3,1,"I10",6,1,"E149",6,2,"N179",,,,,,,,,,,,,,,,,,,,,,,,,,,,,,,,,,,,,,,,6,"I619","E149","G935","G936","I10","N179",,,,,,,,,,,,,,,8,,,2,4,998,9
1,99,,2,3,"M",1077,,41,21,10,,1,"W",5,2013,"U",,"U","U",,,"J690",273,88,,37,5,1,1,"A419",2,1,"L899",2,2,"R64",3,1,"J690",6,1,"E86",,,,,,,,,,,,,,,,,,,,,,,,,,,,,,,,,,,,,,,,,,,,,,5,"J690","A419","E86","L899","R64",,,,,,,,,,,,,,,,8,,,2,4,998,9
1,99,,2,3,"F",1077,,41,21,10,,1,"W",6,2013,"U",,"U","U",,,"I517",233,68,,22,5,1,1,"J189",2,1,"I500",3,1,"I48",3,2,"R000",6,1,"I517",,,,,,,,,,,,,,,,,,,,,,,,,,,,,,,,,,,,,,,,,,,,,,5,"I517","I48","I500","J189","R000",,,,,,,,,,,,,,,,8,,,2,4,998,9
1,99,,2,3,"F",1057,,37,17,8,,1,"W",3,2013,"U",,"U","U",,,"E785",173,111,,37,4,1,1,"R99",2,1,"I10",3,1,"E785",3,2,"E669",,,,,,,,,,,,,,,,,,,,,,,,,,,,,,,,,,,,,,,,,,,,,,,,,4,"E785","E669","I10","R99",,,,,,,,,,,,,,,,,8,,,2,4,998,9
1,99,,2,3,"F",1051,,36,16,7,,1,"M",5,2013,"U",,"U","U",,,"D696",153,111,,37,6,1,1,"A419",2,1,"R048",3,1,"J189",4,1,"D696",6,1,"N179",6,2,"I517",,,,,,,,,,,,,,,,,,,,,,,,,,,,,,,,,,,,,,,,,,,6,"D696","A419","I517","J189","N179","R048",,,,,,,,,,,,,,,8,,,2,4,998,9
1,99,,2,3,"M",1045,,35,15,7,,3,"M",6,2013,"U",,"U","U",,,"I251",215,63,,21,6,1,1,"I499",2,1,"I519",2,2,"I251",3,1,"I10",3,2,"M109",3,3,"J459",,,,,,,,,,,,,,,,,,,,,,,,,,,,,,,,,,,,,,,,,,,5,"I251","I10","I499","J459","M109",,,,,,,,,,,,,,,,8,,,2,4,998,9
1,99,,2,3,"M",1063,,38,18,8,,3,"M",6,2013,"U",,"U","U",,,"I259",215,63,,21,5,1,1,"I499",2,1,"I10",2,2,"I259",2,3,"E149",3,1,"I500",,,,,,,,,,,,,,,,,,,,,,,,,,,,,,,,,,,,,,,,,,,,,,5,"I259","E149","I10","I499","I500",,,,,,,,,,,,,,,,8,,,2,4,998,9
1,99,,2,3,"F",1060,,38,18,8,,3,"W",2,2013,"U",,"U","U",,,"K297",288,111,,37,5,1,1,"R99",2,1,"R101",2,2,"K297",6,1,"F419",6,2,"F329",,,,,,,,,,,,,,,,,,,,,,,,,,,,,,,,,,,,,,,,,,,,,,5,"K297","F329","F419","R101","R99",,,,,,,,,,,,,,,,8,,,2,4,998,9
1,99,,2,3,"F",1049,,35,15,7,,3,"M",4,2013,"U",,"U","U",,,"I839",246,75,,37,7,1,1,"R571",2,1,"I839",3,1,"L039",6,1,"I10",6,2,"J449",6,3,"J459",6,4,"E668",,,,,,,,,,,,,,,,,,,,,,,,,,,,,,,,,,,,,,,,6,"I839","E668","I10","J448","L039","R571",,,,,,,,,,,,,,,8,,,2,4,998,9
1,99,,2,3,"F",1036,,33,13,6,,1,"S",5,2013,"U",,"U","U",,,"I619",236,70,,24,3,1,1,"I619",2,1,"G935",3,1,"I10",,,,,,,,,,,,,,,,,,,,,,,,,,,,,,,,,,,,,,,,,,,,,,,,,,,,3,"I619","G935","I10",,,,,,,,,,,,,,,,,,8,,,2,4,998,9
1,99,,2,3,"M",1071,,40,20,9,,3,"M",6,2013,"U",,"U","U",,,"I48",228,68,,22,6,2,1,"I500",2,2,"I10",3,1,"I48",3,2,"E119",3,3,"I739",3,4,"E790",,,,,,,,,,,,,,,,,,,,,,,,,,,,,,,,,,,,,,,,,,,5,"I48","E115","E790","I10","I500",,,,,,,,,,,,,,,,1,,,1,1,998,9
1,99,,2,3,"M",1067,,39,19,9,,1,"M",7,2013,"U",,"U","U",,,"E112",159,46,,16,7,1,1,"K769",2,1,"E119",3,1,"I10",6,1,"N189",6,2,"R18",6,3,"I259",6,4,"I500",,,,,,,,,,,,,,,,,,,,,,,,,,,,,,,,,,,,,,,,6,"E112","I10","I259","I500","K769","R18",,,,,,,,,,,,,,,8,,,2,4,998,9
1,99,,2,3,"F",1038,,33,13,6,,1,"S",7,2013,"U",,"U","U",,,"I500",230,67,,22,5,1,1,"I64",2,1,"I500",6,1,"E149",6,2,"I10",6,3,"E668",,,,,,,,,,,,,,,,,,,,,,,,,,,,,,,,,,,,,,,,,,,,,,5,"I500","E149","E668","I10","I64",,,,,,,,,,,,,,,,8,,,2,4,998,9
4,99,,2,3,"M",1027,,31,11,5,,3,"S",7,2013,"Y",,"U","U",9,9,"W74",409,120,,39,3,1,1,"T751",1,2,"W74",2,1,"T751",,,,,,,,,,,,,,,,,,,,,,,,,,,,,,,,,,,,,,,,,,,,,,,,,,,,2,"W74","T751",,,,,,,,,,,,,,,,,,,8,,2,2,4,998,9
1,99,,2,4,"F",1034,,32,12,5,,1,"M",5,2013,"U",,"U","U",,,"K802",302,96,,37,4,1,1,"K729",2,1,"K802",3,1,"E876",6,1,"B169",,,,,,,,,,,,,,,,,,,,,,,,,,,,,,,,,,,,,,,,,,,,,,,,,4,"K802","B169","E876","K729",,,,,,,,,,,,,,,,,8,,,2,4,998,9
1,99,,2,4,"M",1065,,39,19,9,,1,"M",6,2013,"U",,"U","U",,,"C169",78,22,,5,5,1,1,"C169",1,2,"C80",6,1,"K922",6,2,"D649",6,3,"E875",,,,,,,,,,,,,,,,,,,,,,,,,,,,,,,,,,,,,,,,,,,,,,4,"C169","D649","E875","K922",,,,,,,,,,,,,,,,,8,,,2,4,998,9
1,99,,2,4,"F",1088,,43,23,11,,3,"W",7,2013,"U",,"U","U",9,9,"X590",423,123,,39,7,1,1,"T848",2,1,"Y831",2,2,"S720",3,1,"J841",6,1,"R91",6,2,"R99",6,3,"X590",,,,,,,,,,,,,,,,,,,,,,,,,,,,,,,,,,,,,,,,7,"X590","J841","R91","R99","S720","T848","Y831",,,,,,,,,,,,,,8,,,2,4,998,9
1,99,,2,4,"M",1052,,36,16,7,,1,"M",4,2013,"U",,"U","U",,,"J181",257,78,,27,7,1,1,"J960",1,2,"A419",2,1,"J181",2,2,"B909",6,1,"K701",6,2,"N179",6,3,"M628",,,,,,,,,,,,,,,,,,,,,,,,,,,,,,,,,,,,,,,,7,"J181","A419","B909","J960","K701","M628","N179",,,,,,,,,,,,,,8,,,2,4,998,9
1,99,,2,4,"M",1080,,42,22,10,,3,"M",5,2013,"U",,"U","U",,,"L899",309,111,,37,3,1,1,"I64",2,1,"A419",3,1,"L899",,,,,,,,,,,,,,,,,,,,,,,,,,,,,,,,,,,,,,,,,,,,,,,,,,,,3,"L899","A419","I64",,,,,,,,,,,,,,,,,,8,,,2,4,998,9
1,99,,2,4,"F",1079,,41,21,10,,1,"W",6,2013,"U",,"U","U",,,"I64",238,70,,24,7,1,1,"G936",1,2,"G935",2,1,"I64",6,1,"I500",6,2,"I10",6,3,"I48",6,4,"E149",,,,,,,,,,,,,,,,,,,,,,,,,,,,,,,,,,,,,,,,7,"I64","E149","G935","G936","I10","I48","I500",,,,,,,,,,,,,,8,,,2,4,998,9
1,99,,2,4,"M",1054,,36,16,7,,1,"M",1,2013,"U",,"U","U",,,"M109",313,111,,37,6,1,1,"K922",1,2,"I859",2,1,"M109",2,2,"I500",3,1,"I119",6,1,"K721",,,,,,,,,,,,,,,,,,,,,,,,,,,,,,,,,,,,,,,,,,,4,"M109","I110","I850","K721",,,,,,,,,,,,,,,,,8,,,2,4,998,9
1,99,,2,4,"F",1085,,43,23,11,,1,"W",2,2013,"U",,"U","U",,,"I64",238,70,,24,7,1,1,"I64",2,1,"I48",3,1,"I10",6,1,"F03",6,2,"M199",6,3,"L899",6,4,"I500",,,,,,,,,,,,,,,,,,,,,,,,,,,,,,,,,,,,,,,,7,"I64","F03","I10","I48","I500","L899","M199",,,,,,,,,,,,,,8,,,2,4,998,9
1,99,,2,4,"F",1074,,40,20,9,,1,"W",3,2013,"U",,"U","U",,,"J90",277,89,,37,8,1,1,"A419",2,1,"A419",3,1,"J90",6,1,"L984",6,2,"R068",6,3,"D696",6,4,"E119",6,5,"I10",,,,,,,,,,,,,,,,,,,,,,,,,,,,,,,,,,,,,7,"J90","A419","D696","E119","I10","L984","R068",,,,,,,,,,,,,,8,,,2,4,998,9
1,99,,2,4,"F",1084,,42,22,10,,1,"W",3,2013,"U",,"U","U",,,"N179",327,100,,31,5,1,1,"J189",1,2,"A419",2,1,"I500",3,1,"N179",6,1,"K922",,,,,,,,,,,,,,,,,,,,,,,,,,,,,,,,,,,,,,,,,,,,,,5,"N179","A419","I500","J189","K922",,,,,,,,,,,,,,,,8,,,2,4,998,9
1,99,,2,4,"F",1056,,37,17,8,,3,"M",6,2013,"U",,"U","U",,,"I219",211,59,,21,2,1,1,"I219",2,1,"I10",,,,,,,,,,,,,,,,,,,,,,,,,,,,,,,,,,,,,,,,,,,,,,,,,,,,,,,2,"I219","I10",,,,,,,,,,,,,,,,,,,8,,,2,4,998,9
1,99,,2,4,"F",1054,,36,16,7,,3,"M",7,2013,"U",,"U","U",,,"E149",159,46,,16,3,1,1,"I219",2,1,"I10",3,1,"E149",,,,,,,,,,,,,,,,,,,,,,,,,,,,,,,,,,,,,,,,,,,,,,,,,,,,3,"E149","I10","I219",,,,,,,,,,,,,,,,,,8,,,2,4,998,9
1,99,,2,4,"M",1078,,41,21,10,,1,"S",3,2013,"U",,"U","U",,,"J440",267,86,,28,3,1,1,"I499",2,1,"J449",3,1,"J189",,,,,,,,,,,,,,,,,,,,,,,,,,,,,,,,,,,,,,,,,,,,,,,,,,,,2,"J440","I499",,,,,,,,,,,,,,,,,,,8,,,2,4,998,9
1,99,,2,4,"F",1015,,29,9,4,,1,"S",3,2013,"U",,"U","U",,,"G809",193,111,,37,3,1,1,"J189",2,1,"G809",3,1,"R628",,,,,,,,,,,,,,,,,,,,,,,,,,,,,,,,,,,,,,,,,,,,,,,,,,,,3,"G809","J189","R628",,,,,,,,,,,,,,,,,,8,,,2,4,998,9
1,99,,2,4,"F",1091,,44,24,11,,2,"W",3,2013,"U",,"U","U",,,"K922",306,111,,37,5,1,1,"I469",2,1,"A419",2,2,"J189",3,1,"K922",6,1,"I500",,,,,,,,,,,,,,,,,,,,,,,,,,,,,,,,,,,,,,,,,,,,,,5,"K922","A419","I469","I500","J189",,,,,,,,,,,,,,,,8,,,2,4,998,9