"restatus","educ1989","educ2003","educflag","monthdth","sex","age","ageflag","ager52","ager27","ager12","ager22","placdth","marstat","weekday","year","injwork","mandeath","methdisp","autopsy","activity","injury","ucod","ucr358","ucr113","ucr130","ucr39","eanum","econdp_1","econds_1","enicon_1","econdp_2","econds_2","enicon_2","econdp_3","econds_3","enicon_3","econdp_4","econds_4","enicon_4","econdp_5","econds_5","enicon_5","econdp_6","econds_6","enicon_6","econdp_7","econds_7","enicon_7","econdp_8","econds_8","enicon_8","econdp_9","econds_9","enicon_9","econdp_10","econds_10","enicon_10","econdp_11","econds_11","enicon_11","econdp_12","econds_12","enicon_12","econdp_13","econds_13","enicon_13","econdp_14","econds_14","enicon_14","econdp_15","econds_15","enicon_15","econdp_16","econds_16","enicon_16","econdp_17","econds_17","enicon_17","econdp_18","econds_18","enicon_18","econdp_19","econds_19","enicon_19","econdp_20","econds_20","enicon_20","ranum","record_1","record_2","record_3","record_4","record_5","record_6","record_7","record_8","record_9","record_10","record_11","record_12","record_13","record_14","record_15","record_16","record_17","record_18","record_19","record_20","race","brace","raceimp","racer3","racer5","hispanic","hspanicr"
1,99,,2,1,"M",1005,,27,7,3,,1,"S",2,2012,"U",,"U","N",,,"M009",313,111,,37,3,1,1,"R048",2,1,"A419",3,1,"M009",,,,,,,,,,,,,,,,,,,,,,,,,,,,,,,,,,,,,,,,,,,,,,,,,,,,3,"M009","A419","R048",,,,,,,,,,,,,,,,,,8,,,2,4,998,9
1,99,,2,1,"M",1073,,40,20,9,,1,"M",3,2012,"U",,"U","N",,,"J189",257,78,,27,3,1,1,"A419",2,1,"L899",3,1,"J189",,,,,,,,,,,,,,,,,,,,,,,,,,,,,,,,,,,,,,,,,,,,,,,,,,,,3,"J189","A419","L899",,,,,,,,,,,,,,,,,,8,,,2,4,998,9
1,99,,2,1,"M",1038,,33,13,6,,3,"W",4,2012,"U",,"U","N",,,"I219",211,59,,21,4,1,1,"I499",2,1,"I219",6,1,"F179",6,2,"E872",,,,,,,,,,,,,,,,,,,,,,,,,,,,,,,,,,,,,,,,,,,,,,,,,4,"I219","E872","F179","I499",,,,,,,,,,,,,,,,,8,,,2,4,998,9
1,99,,2,1,"M",1056,,37,17,8,,1,"M",4,2012,"U",,"U","N",,,"A419",23,10,,37,4,1,1,"A419",2,1,"L039",6,1,"K922",6,2,"I500",,,,,,,,,,,,,,,,,,,,,,,,,,,,,,,,,,,,,,,,,,,,,,,,,4,"A419","I500","K922","L039",,,,,,,,,,,,,,,,,8,,,2,4,998,9
1,99,,2,1,"M",1088,,43,23,11,,3,"M",6,2012,"U",,"U","N",,,"J449",267,86,,28,2,2,1,"J449",6,1,"R54",,,,,,,,,,,,,,,,,,,,,,,,,,,,,,,,,,,,,,,,,,,,,,,,,,,,,,,2,"J449","R54",,,,,,,,,,,,,,,,,,,8,,,2,4,998,9
1,99,,2,1,"F",1076,,41,21,10,,1,"S",3,2012,"U",,"U","N",,,"E149",159,46,,16,3,1,1,"I516",2,1,"I10",3,1,"E149",,,,,,,,,,,,,,,,,,,,,,,,,,,,,,,,,,,,,,,,,,,,,,,,,,,,3,"E149","I10","I516",,,,,,,,,,,,,,,,,,8,,,2,4,998,9
1,99,,2,1,"F",1073,,40,20,9,,3,"M",4,2012,"U",,"U","N",,,"E142",159,46,,16,4,2,1,"K922",3,1,"N19",6,1,"E149",6,2,"I10",,,,,,,,,,,,,,,,,,,,,,,,,,,,,,,,,,,,,,,,,,,,,,,,,5,"E142","E149","I10","K922","N19",,,,,,,,,,,,,,,,8,,,2,4,998,9
1,99,,2,1,"M",1049,,35,15,7,,3,"M",4,2012,"U",,"U","N",,,"C259",88,25,,7,1,1,1,"C259",,,,,,,,,,,,,,,,,,,,,,,,,,,,,,,,,,,,,,,,,,,,,,,,,,,,,,,,,,1,"C259",,,,,,,,,,,,,,,,,,,,8,,,2,4,998,9
1,99,,2,1,"M",1064,,38,18,8,,1,"M",5,2012,"U",,"U","N",,,"E142",159,46,,16,8,1,1,"A419",1,2,"R688",2,1,"J189",3,1,"N19",6,1,"E149",6,2,"T876",6,3,"Y835",6,4,"H609",,,,,,,,,,,,,,,,,,,,,,,,,,,,,,,,,,,,,9,"E142","A419","E149","H609","J189","N19","R688","T876","Y835",,,,,,,,,,,,8,,,2,4,998,9
1,99,,2,1,"M",1072,,40,20,9,,1,"M",6,2012,"U",,"U","N",,,"E149",159,46,,16,4,1,1,"J189",1,2,"J90",2,1,"E149",2,2,"I10",,,,,,,,,,,,,,,,,,,,,,,,,,,,,,,,,,,,,,,,,,,,,,,,,4,"E149","I10","J189","J90",,,,,,,,,,,,,,,,,8,,,2,4,998,9
1,99,,2,1,"F",1079,,41,21,10,,1,"W",6,2012,"U",,"U","N",,,"I499",228,68,,22,5,1,1,"I517",1,2,"I500",2,1,"I499",6,1,"I10",6,2,"E059",,,,,,,,,,,,,,,,,,,,,,,,,,,,,,,,,,,,,,,,,,,,,,5,"I499","E059","I10","I500","I517",,,,,,,,,,,,,,,,8,,,2,4,998,9
1,99,,2,1,"F",1084,,42,22,10,,1,"M",7,2012,"U",,"U","N",,,"I110",207,56,,20,2,1,1,"I509",2,1,"I10",,,,,,,,,,,,,,,,,,,,,,,,,,,,,,,,,,,,,,,,,,,,,,,,,,,,,,,3,"I110","I10","I509",,,,,,,,,,,,,,,,,,8,,,2,4,998,9
1,99,,2,1,"M",1080,,42,22,10,,1,"U",1,2012,"U",,"U","N",,,"I219",211,59,,21,4,1,1,"I219",2,1,"I10",3,1,"N189",6,1,"R54",,,,,,,,,,,,,,,,,,,,,,,,,,,,,,,,,,,,,,,,,,,,,,,,,4,"I219","I10","N189","R54",,,,,,,,,,,,,,,,,8,,,2,4,998,9
1,99,,2,1,"F",1030,,32,12,5,,1,"M",2,2012,"U",,"U","N",,,"I059",201,55,,22,5,1,1,"A419",2,1,"J189",3,1,"I500",6,1,"I059",6,2,"I48",,,,,,,,,,,,,,,,,,,,,,,,,,,,,,,,,,,,,,,,,,,,,,5,"I059","A419","I48","I500","J189",,,,,,,,,,,,,,,,8,,,2,4,998,9
1,99,,2,1,"M",1074,,40,20,9,,3,"M",3,2012,"U",,"U","N",,,"I64",238,70,,24,5,1,1,"I219",2,1,"I64",2,2,"G819",3,1,"I10",6,1,"E149",,,,,,,,,,,,,,,,,,,,,,,,,,,,,,,,,,,,,,,,,,,,,,5,"I64","E149","G819","I10","I219",,,,,,,,,,,,,,,,8,,,2,4,998,9
1,99,,2,1,"M",1051,,36,16,7,,1,"M",5,2012,"U",,"U","N",,,"K922",306,111,,37,2,1,1,"A419",2,1,"K922",,,,,,,,,,,,,,,,,,,,,,,,,,,,,,,,,,,,,,,,,,,,,,,,,,,,,,,2,"K922","A419",,,,,,,,,,,,,,,,,,,8,,,2,4,998,9
1,99,,2,1,"F",1078,,41,21,10,,1,"W",6,2012,"U",,"U","N",,,"J189",257,78,,27,2,1,1,"A419",2,1,"J189",,,,,,,,,,,,,,,,,,,,,,,,,,,,,,,,,,,,,,,,,,,,,,,,,,,,,,,2,"J189","A419",,,,,,,,,,,,,,,,,,,8,,,2,4,998,9
1,99,,2,1,"M",1057,,37,17,8,,1,"M",2,2012,"U",,"U","U",,,"I634",237,70,,24,3,1,1,"A419",2,1,"I634",2,2,"I64",,,,,,,,,,,,,,,,,,,,,,,,,,,,,,,,,,,,,,,,,,,,,,,,,,,,2,"I634","A419",,,,,,,,,,,,,,,,,,,8,,,2,4,998,9
1,99,,2,1,"M",1069,,39,19,9,,1,"M",5,2012,"U",,"U","N",,,"J189",257,78,,27,3,1,1,"J189",6,1,"I500",6,2,"I272",,,,,,,,,,,,,,,,,,,,,,,,,,,,,,,,,,,,,,,,,,,,,,,,,,,,3,"J189","I272","I500",,,,,,,,,,,,,,,,,,8,,,2,4,998,9
1,99,,2,1,"F",1058,,37,17,8,,1,"W",6,2012,"U",,"U","N",,,"J189",257,78,,27,3,1,1,"J969",2,1,"J041",3,1,"J189",,,,,,,,,,,,,,,,,,,,,,,,,,,,,,,,,,,,,,,,,,,,,,,,,,,,3,"J189","J041","J969",,,,,,,,,,,,,,,,,,8,,,2,4,998,9
1,99,,2,1,"M",1055,,37,17,8,,1,"M",6,2012,"U",,"U","N",,,"K922",306,111,,37,1,1,1,"K922",,,,,,,,,,,,,,,,,,,,,,,,,,,,,,,,,,,,,,,,,,,,,,,,,,,,,,,,,,1,"K922",,,,,,,,,,,,,,,,,,,,8,,,2,4,998,9
1,99,,2,1,"F",1061,,38,18,8,,3,"S",7,2012,"U",,"U","N",,,"R470",380,110,,36,1,6,1,"R470",,,,,,,,,,,,,,,,,,,,,,,,,,,,,,,,,,,,,,,,,,,,,,,,,,,,,,,,,,1,"R470",,,,,,,,,,,,,,,,,,,,8,,,2,4,998,9
1,99,,2,1,"M",1073,,40,20,9,,1,"S",1,2012,"U",,"U","N",,,"C679",118,35,,12,1,1,1,"C679",,,,,,,,,,,,,,,,,,,,,,,,,,,,,,,,,,,,,,,,,,,,,,,,,,,,,,,,,,1,"C679",,,,,,,,,,,,,,,,,,,,8,,,2,4,998,9
1,99,,2,1,"M",1059,,37,17,8,,1,"M",2,2012,"U",,"U","N",,,"C169",78,22,,5,2,1,1,"D695",2,1,"C169",,,,,,,,,,,,,,,,,,,,,,,,,,,,,,,,,,,,,,,,,,,,,,,,,,,,,,,2,"C169","D695",,,,,,,,,,,,,,,,,,,8,,,2,4,998,9
1,99,,2,1,"M",1063,,38,18,8,,1,"M",3,2012,"U",,"U","N",,,"I714",242,73,,26,2,1,1,"J189",3,1,"I714",,,,,,,,,,,,,,,,,,,,,,,,,,,,,,,,,,,,,,,,,,,,,,,,,,,,,,,2,"I714","J189",,,,,,,,,,,,,,,,,,,8,,,2,4,998,9
1,99,,2,2,"F",1024,,30,10,4,,2,"S",5,2012,"U",,"U","U",,,"G808",193,111,,37,3,2,1,"G809",2,2,"G039",2,3,"G824",,,,,,,,,,,,,,,,,,,,,,,,,,,,,,,,,,,,,,,,,,,,,,,,,,,,4,"G808","G039","G809","G824",,,,,,,,,,,,,,,,,8,,,2,4,998,9
1,99,,2,2,"F",1065,,39,19,9,,3,"M",7,2012,"U",,"U","U",,,"E119",159,46,,16,3,2,1,"E119",6,1,"K800",6,2,"E668",,,,,,,,,,,,,,,,,,,,,,,,,,,,,,,,,,,,,,,,,,,,,,,,,,,,3,"E119","E668","K800",,,,,,,,,,,,,,,,,,8,,,2,4,998,9
1,99,,2,2,"F",1041,,34,14,6,,1,"M",1,2012,"U",,"U","U",,,"I48",228,68,,22,4,1,1,"A419",2,1,"I509",6,1,"E059",6,2,"I48",,,,,,,,,,,,,,,,,,,,,,,,,,,,,,,,,,,,,,,,,,,,,,,,,4,"I48","A419","E059","I509",,,,,,,,,,,,,,,,,8,,,2,4,998,9
1,99,,2,2,"F",1079,,41,21,10,,1,"W",1,2012,"U",,"U","U",,,"I500",230,67,,22,3,1,1,"A419",2,1,"L899",3,1,"I500",,,,,,,,,,,,,,,,,,,,,,,,,,,,,,,,,,,,,,,,,,,,,,,,,,,,3,"I500","A419","L899",,,,,,,,,,,,,,,,,,8,,,2,4,998,9
1,99,,2,2,"M",1066,,39,19,9,,1,"M",3,2012,"U",,"U","U",,,"N185",327,100,,31,3,1,1,"J958",2,1,"Y849",3,1,"N185",,,,,,,,,,,,,,,,,,,,,,,,,,,,,,,,,,,,,,,,,,,,,,,,,,,,3,"N185","J958","Y849",,,,,,,,,,,,,,,,,,8,,,2,4,998,9
1,99,,2,2,"M",1059,,37,17,8,,1,"M",4,2012,"U",,"U","U",,,"I330",221,65,,22,3,1,1,"A415",2,1,"I330",6,1,"E119",,,,,,,,,,,,,,,,,,,,,,,,,,,,,,,,,,,,,,,,,,,,,,,,,,,,3,"I330","A415","E119",,,,,,,,,,,,,,,,,,8,,,2,4,998,9
1,99,,2,2,"F",1070,,40,20,9,,1,"W",1,2012,"U",,"U","U",,,"K802",302,96,,37,4,1,1,"A419",2,1,"K802",6,1,"I48",6,2,"I500",,,,,,,,,,,,,,,,,,,,,,,,,,,,,,,,,,,,,,,,,,,,,,,,,4,"K802","A419","I48","I500",,,,,,,,,,,,,,,,,8,,,2,4,998,9
1,99,,2,2,"F",1074,,40,20,9,,1,"W",2,2012,"U",,"U","U",,,"I269",218,68,,22,4,1,1,"J189",2,1,"J984",3,1,"I269",6,1,"J439",,,,,,,,,,,,,,,,,,,,,,,,,,,,,,,,,,,,,,,,,,,,,,,,,3,"I269","J189","J439",,,,,,,,,,,,,,,,,,8,,,2,4,998,9
1,99,,2,2,"M",1053,,36,16,7,,1,"D",4,2012,"U",,"U","U",,,"A415",23,10,,37,4,1,1,"A415",6,1,"N19",6,2,"I10",6,3,"E119",,,,,,,,,,,,,,,,,,,,,,,,,,,,,,,,,,,,,,,,,,,,,,,,,4,"A415","E119","I10","N19",,,,,,,,,,,,,,,,,8,,,2,4,998,9
1,99,,2,2,"M",2001,,12,2,1,12,1,"S",6,2012,"U",,"U","U",,,"A419",23,10,9,37,3,1,1,"R688",2,1,"J80",3,1,"A419",,,,,,,,,,,,,,,,,,,,,,,,,,,,,,,,,,,,,,,,,,,,,,,,,,,,3,"A419","J80","R688",,,,,,,,,,,,,,,,,,8,,,2,4,998,9
1,99,,2,2,"F",1055,,37,17,8,,1,"S",6,2012,"U",,"U","U",,,"I499",228,68,,22,6,1,1,"I499",6,1,"N185",6,2,"J81",6,3,"I10",6,4,"E149",6,5,"D696",,,,,,,,,,,,,,,,,,,,,,,,,,,,,,,,,,,,,,,,,,,6,"I499","D696","E149","I10","J81","N185",,,,,,,,,,,,,,,8,,,2,4,998,9
1,99,,2,2,"M",1084,,42,22,10,,3,"M",6,2012,"U",,"U","U",,,"E109",159,46,,16,2,2,1,"E109",6,1,"I10",,,,,,,,,,,,,,,,,,,,,,,,,,,,,,,,,,,,,,,,,,,,,,,,,,,,,,,2,"E109","I10",,,,,,,,,,,,,,,,,,,8,,,2,4,998,9
1,99,,2,2,"M",1063,,38,18,8,,1,"S",1,2012,"U",,"U","U",,9,"A415",23,10,,37,6,1,1,"A415",6,1,"I64",6,2,"D696",6,3,"J189",6,4,"S423",6,5,"X590",,,,,,,,,,,,,,,,,,,,,,,,,,,,,,,,,,,,,,,,,,,6,"A415","D696","I64","J189","S423","X590",,,,,,,,,,,,,,,1,,,1,1,998,9
1,99,,2,2,"M",1070,,40,20,9,,3,"M",1,2012,"U",,"U","U",,,"E149",159,46,,16,4,1,1,"I219",2,1,"I10",3,1,"E149",6,1,"E785",,,,,,,,,,,,,,,,,,,,,,,,,,,,,,,,,,,,,,,,,,,,,,,,,4,"E149","E785","I10","I219",,,,,,,,,,,,,,,,,8,,,2,4,998,9
1,99,,2,2,"M",1066,,39,19,9,,1,"W",1,2012,"U",,"U","U",9,9,"W19",406,118,,39,3,1,1,"S099",2,1,"W19",3,1,"I469",,,,,,,,,,,,,,,,,,,,,,,,,,,,,,,,,,,,,,,,,,,,,,,,,,,,3,"W19","I469","S099",,,,,,,,,,,,,,,,,,8,,,2,4,998,9
1,99,,2,2,"F",1058,,37,17,8,,3,"W",1,2012,"U",,"U","U",9,9,"W76",411,123,,39,6,1,1,"T71",1,2,"W76",2,1,"F29",2,2,"F329",6,1,"E149",6,2,"I10",,,,,,,,,,,,,,,,,,,,,,,,,,,,,,,,,,,,,,,,,,,6,"W76","E149","F29","F329","I10","T71",,,,,,,,,,,,,,,8,,,2,4,998,9
1,99,,2,2,"M",1071,,40,20,9,,3,"M",4,2012,"U",,"U","U",,,"A419",23,10,,37,4,1,1,"A419",6,1,"I64",6,2,"E149",6,3,"I10",,,,,,,,,,,,,,,,,,,,,,,,,,,,,,,,,,,,,,,,,,,,,,,,,4,"A419","E149","I10","I64",,,,,,,,,,,,,,,,,8,,,2,4,998,9
4,99,,2,2,"M",1020,,30,10,4,,1,"S",6,2012,"U",,"U","U",,,"C959",137,40,,14,3,1,1,"A419",2,1,"C959",6,1,"M726",,,,,,,,,,,,,,,,,,,,,,,,,,,,,,,,,,,,,,,,,,,,,,,,,,,,3,"C959","A419","M726",,,,,,,,,,,,,,,,,,8,,,2,4,998,9
1,99,,2,2,"M",1042,,34,14,6,,2,"M",7,2012,"U",,"U","U",,,"I120",208,69,,23,6,1,1,"I509",2,1,"N19",3,1,"N185",3,2,"I10",6,1,"D649",6,2,"E872",,,,,,,,,,,,,,,,,,,,,,,,,,,,,,,,,,,,,,,,,,,7,"I120","D649","E872","I10","I509","N185","N19",,,,,,,,,,,,,,8,,,2,4,998,9
1,99,,2,2,"M",1037,,33,13,6,,2,"M",2,2012,"U",,"U","U",,,"E111",159,46,,16,2,1,1,"E141",2,1,"E119",,,,,,,,,,,,,,,,,,,,,,,,,,,,,,,,,,,,,,,,,,,,,,,,,,,,,,,1,"E111",,,,,,,,,,,,,,,,,,,,8,,,2,4,998,9
1,99,,2,2,"M",1052,,36,16,7,,1,"M",2,2012,"U",,"U","U",,,"K704",298,94,,30,3,1,1,"K729",2,1,"F101",6,1,"R568",,,,,,,,,,,,,,,,,,,,,,,,,,,,,,,,,,,,,,,,,,,,,,,,,,,,2,"K704","R568",,,,,,,,,,,,,,,,,,,8,,,2,4,998,9
1,99,,2,2,"F",1068,,39,19,9,,1,"W",3,2012,"U",,"U","U",,,"E119",159,46,,16,4,1,1,"A419",2,1,"I629",3,1,"E119",3,2,"I10",,,,,,,,,,,,,,,,,,,,,,,,,,,,,,,,,,,,,,,,,,,,,,,,,4,"E119","A419","I10","I629",,,,,,,,,,,,,,,,,8,,,2,4,998,9
1,99,,2,2,"F",1048,,35,15,7,,1,"M",3,2012,"U",,"U","U",,,"I499",228,68,,22,5,1,1,"I499",6,1,"J690",6,2,"N185",6,3,"E149",6,4,"I10",,,,,,,,,,,,,,,,,,,,,,,,,,,,,,,,,,,,,,,,,,,,,,5,"I499","E149","I10","J690","N185",,,,,,,,,,,,,,,,8,,,2,4,998,9
1,99,,2,2,"M",1064,,38,18,8,,1,"S",3,2012,"U",,"U","U",,,"I499",228,68,,22,3,1,1,"I499",6,1,"J449",6,2,"F179",,,,,,,,,,,,,,,,,,,,,,,,,,,,,,,,,,,,,,,,,,,,,,,,,,,,3,"I499","F179","J449",,,,,,,,,,,,,,,,,,8,,,2,4,998,9
1,99,,2,3,"M",1071,,40,20,9,,3,"M",5,2012,"U",,"U","N",,,"E109",159,46,,16,5,1,1,"I500",2,1,"E109",3,1,"I10",6,1,"N185",6,2,"D649",,,,,,,,,,,,,,,,,,,,,,,,,,,,,,,,,,,,,,,,,,,,,,5,"E109","D649","I10","I500","N185",,,,,,,,,,,,,,,,8,,,2,4,998,9
1,99,,2,3,"M",1068,,39,19,9,,1,"W",6,2012,"U",,"U","N",,,"L039",308,111,,37,4,1,1,"A419",2,1,"L039",6,1,"E872",6,2,"N179",,,,,,,,,,,,,,,,,,,,,,,,,,,,,,,,,,,,,,,,,,,,,,,,,4,"L039","A419","E872","N179",,,,,,,,,,,,,,,,,8,,,2,4,998,9
1,99,,2,3,"F",1089,,43,23,11,,3,"W",7,2012,"U",,"U","N",,,"E149",159,46,,16,4,1,1,"I469",2,1,"I219",3,1,"E149",6,1,"E162",,,,,,,,,,,,,,,,,,,,,,,,,,,,,,,,,,,,,,,,,,,,,,,,,4,"E149","E162","I219","I469",,,,,,,,,,,,,,,,,8,,,2,4,998,9
1,99,,2,3,"F",1069,,39,19,9,,3,"W",1,2012,"U",,"U","N",,,"E142",159,46,,16,4,1,1,"N185",2,1,"E149",3,1,"D649",6,1,"I10",,,,,,,,,,,,,,,,,,,,,,,,,,,,,,,,,,,,,,,,,,,,,,,,,5,"E142","D649","E149","I10","N185",,,,,,,,,,,,,,,,8,,,2,4,998,9
1,99,,2,3,"M",1032,,32,12,5,,3,"S",2,2012,"U",,"U","N",,,"E668",169,111,,37,3,1,1,"I219",2,1,"E668",6,1,"N459",,,,,,,,,,,,,,,,,,,,,,,,,,,,,,,,,,,,,,,,,,,,,,,,,,,,3,"E668","I219","N459",,,,,,,,,,,,,,,,,,8,,,2,4,998,9
1,99,,2,3,"F",1046,,35,15,7,,2,"M",3,2012,"U",,"U","N",,,"I64",238,70,,24,4,1,1,"I64",2,1,"D649",3,1,"I10",6,1,"E119",,,,,,,,,,,,,,,,,,,,,,,,,,,,,,,,,,,,,,,,,,,,,,,,,4,"I64","D649","E119","I10",,,,,,,,,,,,,,,,,8,,,2,4,998,9
1,99,,2,3,"M",1049,,35,15,7,,2,"M",3,2012,"U",,"U","N",,,"I64",238,70,,24,2,1,1,"I64",2,1,"I10",,,,,,,,,,,,,,,,,,,,,,,,,,,,,,,,,,,,,,,,,,,,,,,,,,,,,,,2,"I64","I10",,,,,,,,,,,,,,,,,,,8,,,2,4,998,9
1,99,,2,3,"F",1068,,39,19,9,,3,"W",3,2012,"U",,"U","N",,9,"I64",238,70,,24,6,1,1,"T179",1,2,"W79",1,3,"R11",2,1,"I64",6,1,"F179",6,2,"F109",,,,,,,,,,,,,,,,,,,,,,,,,,,,,,,,,,,,,,,,,,,6,"I64","F109","F179","R11","T179","W79",,,,,,,,,,,,,,,8,,,2,4,998,9
1,99,,2,6,"M",1045,,35,15,7,,1,"S",5,2012,"U",,"U","N",,,"A419",23,10,,37,5,1,1,"I469",1,2,"I219",2,1,"A419",6,1,"I500",6,2,"N189",,,,,,,,,,,,,,,,,,,,,,,,,,,,,,,,,,,,,,,,,,,,,,5,"A419","I219","I469","I500","N189",,,,,,,,,,,,,,,,8,,,2,4,998,9
1,99,,2,3,"F",1032,,32,12,5,,1,"M",5,2012,"U",,"U","N",,,"I090",204,55,,22,6,1,1,"R688",2,1,"A419",3,1,"I330",6,1,"I090",6,2,"I099",6,3,"I091",,,,,,,,,,,,,,,,,,,,,,,,,,,,,,,,,,,,,,,,,,,5,"I090","A419","I091","I330","R688",,,,,,,,,,,,,,,,8,,,2,4,998,9
1,99,,2,3,"M",1064,,38,18,8,,3,"M",2,2012,"U",,"U","N",,,"I219",211,59,,21,7,1,1,"I219",2,1,"R000",3,1,"I500",3,2,"I10",6,1,"L031",6,2,"J449",6,3,"G473",,,,,,,,,,,,,,,,,,,,,,,,,,,,,,,,,,,,,,,,7,"I219","G473","I10","I500","J449","L031","R000",,,,,,,,,,,,,,8,,,2,4,998,9
1,99,,2,3,"F",1071,,40,20,9,,3,"W",3,2012,"U",,"U","N",,,"C539",107,30,,10,1,1,1,"C539",,,,,,,,,,,,,,,,,,,,,,,,,,,,,,,,,,,,,,,,,,,,,,,,,,,,,,,,,,1,"C539",,,,,,,,,,,,,,,,,,,,8,,,2,4,998,9
1,99,,2,3,"F",1080,,42,22,10,,3,"W",4,2012,"U",,"U","N",,,"C541",108,31,,10,4,1,1,"C541",6,1,"I10",6,2,"E149",6,3,"D649",,,,,,,,,,,,,,,,,,,,,,,,,,,,,,,,,,,,,,,,,,,,,,,,,4,"C541","D649","E149","I10",,,,,,,,,,,,,,,,,8,,,2,4,998,9
1,99,,2,3,"M",1044,,34,14,6,,1,"M",4,2012,"U",,"U","U",,,"I10",206,69,,23,5,1,1,"I499",2,1,"I10",6,1,"E149",6,2,"E785",6,3,"E668",,,,,,,,,,,,,,,,,,,,,,,,,,,,,,,,,,,,,,,,,,,,,,5,"I10","E149","E668","E785","I499",,,,,,,,,,,,,,,,8,,,2,4,998,9
1,99,,2,3,"M",1087,,43,23,11,,3,"W",6,2012,"U",,"U","N",,,"R54",376,110,,36,1,2,1,"R54",,,,,,,,,,,,,,,,,,,,,,,,,,,,,,,,,,,,,,,,,,,,,,,,,,,,,,,,,,1,"R54",,,,,,,,,,,,,,,,,,,,8,,,2,4,998,9
1,99,,2,3,"M",1066,,39,19,9,,1,"M",1,2012,"U",,"U","N",,,"K922",306,111,,37,2,1,1,"K922",6,1,"E46",,,,,,,,,,,,,,,,,,,,,,,,,,,,,,,,,,,,,,,,,,,,,,,,,,,,,,,2,"K922","E46",,,,,,,,,,,,,,,,,,,1,,,1,1,998,9
1,99,,2,3,"F",1047,,35,15,7,,3,"W",1,2012,"U",,"U","N",,,"D649",152,45,,37,6,1,1,"I469",2,1,"I500",6,1,"E149",6,2,"I10",6,3,"N189",6,4,"D649",,,,,,,,,,,,,,,,,,,,,,,,,,,,,,,,,,,,,,,,,,,6,"D649","E149","I10","I469","I500","N189",,,,,,,,,,,,,,,8,,,2,4,998,9
1,99,,2,3,"M",1046,,35,15,7,,1,"S",4,2012,"U",,"U","N",,,"E109",159,46,,16,4,1,1,"I219",2,1,"E109",3,1,"I10",6,1,"E162",,,,,,,,,,,,,,,,,,,,,,,,,,,,,,,,,,,,,,,,,,,,,,,,,4,"E109","E162","I10","I219",,,,,,,,,,,,,,,,,8,,,2,4,998,9
1,99,,2,3,"F",1052,,36,16,7,,3,"S",4,2012,"U",,"U","N",,,"I219",211,59,,21,4,1,1,"I219",2,1,"I10",2,2,"R739",6,1,"E668",,,,,,,,,,,,,,,,,,,,,,,,,,,,,,,,,,,,,,,,,,,,,,,,,4,"I219","E668","I10","R739",,,,,,,,,,,,,,,,,8,,,2,4,998,9
1,99,,2,3,"F",1062,,38,18,8,,3,"M",5,2012,"U",,"U","N",,,"E119",159,46,,16,5,1,1,"I219",2,1,"E119",2,2,"I10",6,1,"E639",6,2,"F179",,,,,,,,,,,,,,,,,,,,,,,,,,,,,,,,,,,,,,,,,,,,,,5,"E119","E639","F179","I10","I219",,,,,,,,,,,,,,,,8,,,2,4,998,9
1,99,,2,3,"M",1075,,41,21,10,,2,"W",6,2012,"U",,"U","N",,,"A419",23,10,,37,9,1,1,"R688",2,1,"N185",2,2,"D689",3,1,"A419",6,1,"J869",6,2,"J90",6,3,"J449",6,4,"I251",6,5,"E149",,,,,,,,,,,,,,,,,,,,,,,,,,,,,,,,,,9,"A419","D689","E149","I251","J449","J869","J90","N185","R688",,,,,,,,,,,,8,,,2,4,998,9
1,99,,2,3,"M",1055,,37,17,8,,1,"M",2,2012,"U",,"U","N",,,"A419",23,10,,37,3,1,1,"R688",2,1,"A419",6,1,"E119",,,,,,,,,,,,,,,,,,,,,,,,,,,,,,,,,,,,,,,,,,,,,,,,,,,,3,"A419","E119","R688",,,,,,,,,,,,,,,,,,8,,,2,4,998,9
1,99,,2,3,"F",1031,,32,12,5,,3,"M",6,2012,"U",,"U","N",,9,"J459",268,85,,28,4,1,1,"J459",2,1,"T179",2,2,"W80",6,1,"E668",,,,,,,,,,,,,,,,,,,,,,,,,,,,,,,,,,,,,,,,,,,,,,,,,4,"J459","E668","T179","W80",,,,,,,,,,,,,,,,,8,,,2,4,998,9
1,99,,2,3,"F",1071,,40,20,9,,3,"M",7,2012,"U",,"U","N",,,"C56",109,32,,10,3,1,1,"C56",1,2,"R18",6,1,"D649",,,,,,,,,,,,,,,,,,,,,,,,,,,,,,,,,,,,,,,,,,,,,,,,,,,,3,"C56","D649","R18",,,,,,,,,,,,,,,,,,8,,,2,4,998,9
1,99,,2,3,"F",1064,,38,18,8,,3,"W",7,2012,"U",,"U","N",,,"E43",167,48,,37,5,1,1,"I469",2,1,"E43",2,2,"E46",3,1,"G309",6,1,"R630",,,,,,,,,,,,,,,,,,,,,,,,,,,,,,,,,,,,,,,,,,,,,,5,"E43","E46","G309","I469","R630",,,,,,,,,,,,,,,,8,,,2,4,998,9
1,99,,2,2,"F",1095,,45,25,11,,1,"W",4,2012,"U",,"U","N",,,"K564",293,111,,37,3,1,1,"A419",2,1,"K566",3,1,"K564",,,,,,,,,,,,,,,,,,,,,,,,,,,,,,,,,,,,,,,,,,,,,,,,,,,,2,"K564","A419",,,,,,,,,,,,,,,,,,,8,,,2,4,998,9
1,99,,2,4,"F",1081,,42,22,10,,1,"W",1,2012,"U",,"U","U",,,"I490",228,68,,22,4,1,1,"I469",2,1,"I490",2,2,"I519",6,1,"I10",,,,,,,,,,,,,,,,,,,,,,,,,,,,,,,,,,,,,,,,,,,,,,,,,3,"I490","I10","I469",,,,,,,,,,,,,,,,,,8,,,2,4,998,9
1,99,,2,4,"M",1026,,31,11,5,,1,"S",2,2012,"U",,"U","U",,,"A419",23,10,,37,2,1,1,"A419",2,1,"R99",,,,,,,,,,,,,,,,,,,,,,,,,,,,,,,,,,,,,,,,,,,,,,,,,,,,,,,2,"A419","R99",,,,,,,,,,,,,,,,,,,8,,,2,4,998,9
1,99,,2,4,"M",1015,,29,9,4,,1,"S",4,2012,"U",,"U","U",,,"J80",278,89,,37,3,1,1,"G932",2,1,"J80",6,1,"A099",,,,,,,,,,,,,,,,,,,,,,,,,,,,,,,,,,,,,,,,,,,,,,,,,,,,3,"J80","A099","G932",,,,,,,,,,,,,,,,,,8,,,2,4,998,9
1,99,,2,4,"M",1063,,38,18,8,,1,"M",5,2012,"U",,"U","U",,,"I251",215,63,,21,8,1,1,"R688",2,1,"N185",3,1,"I251",3,2,"I259",6,1,"J449",6,2,"E149",6,3,"I10",6,4,"I64",,,,,,,,,,,,,,,,,,,,,,,,,,,,,,,,,,,,,7,"I251","E149","I10","I64","J449","N185","R688",,,,,,,,,,,,,,8,,,2,4,998,9
1,99,,2,4,"M",1055,,37,17,8,,3,"M",6,2012,"U",,"U","U",,,"E119",159,46,,16,4,2,1,"E119",3,1,"I519",6,1,"G473",6,2,"E669",,,,,,,,,,,,,,,,,,,,,,,,,,,,,,,,,,,,,,,,,,,,,,,,,4,"E119","E669","G473","I519",,,,,,,,,,,,,,,,,8,,,2,4,998,9
1,99,,2,4,"F",1074,,40,20,9,,1,"W",6,2012,"U",,"U","U",,,"E142",159,46,,16,4,1,1,"I64",2,1,"N185",3,1,"E149",6,1,"I10",,,,,,,,,,,,,,,,,,,,,,,,,,,,,,,,,,,,,,,,,,,,,,,,,5,"E142","E149","I10","I64","N185",,,,,,,,,,,,,,,,8,,,2,4,998,9
1,99,,2,4,"F",1082,,42,22,10,,2,"W",4,2012,"U",,"U","U",,,"I10",206,69,,23,7,1,1,"T817",2,1,"Y838",3,1,"I10",3,2,"E149",3,3,"E790",6,1,"E785",6,2,"D649",,,,,,,,,,,,,,,,,,,,,,,,,,,,,,,,,,,,,,,,7,"I10","D649","E149","E785","E790","T817","Y838",,,,,,,,,,,,,,8,,,2,4,998,9
1,99,,2,4,"F",1057,,37,17,8,,1,"M",4,2012,"U",,"U","U",,,"I219",211,59,,21,14,1,1,"R688",1,2,"I500",1,3,"J969",1,4,"K767",2,1,"I219",2,2,"E145",2,3,"J81",2,4,"B179",2,5,"I639",3,1,"I251",3,2,"I679",3,3,"E119",6,1,"A419",6,2,"J189",,,,,,,,,,,,,,,,,,,12,"I219","A419","B179","E115","I251","I500","I639","J189","J81","J969","K767","R688",,,,,,,,,8,,,2,4,998,9
1,99,,2,4,"M",1035,,33,13,6,,1,"M",5,2012,"U",,"U","U",,,"D619",151,45,,37,6,1,1,"I509",2,1,"D649",2,2,"D65",3,1,"D619",6,1,"C859",6,2,"C787",,,,,,,,,,,,,,,,,,,,,,,,,,,,,,,,,,,,,,,,,,,5,"D619","C787","C859","D65","I509",,,,,,,,,,,,,,,,8,,,2,4,998,9
1,99,,2,4,"F",1011,,28,8,3,,1,"S",6,2012,"U",,"U","U",,,"I099",204,55,,22,2,1,1,"I500",2,1,"I099",,,,,,,,,,,,,,,,,,,,,,,,,,,,,,,,,,,,,,,,,,,,,,,,,,,,,,,2,"I099","I500",,,,,,,,,,,,,,,,,,,8,,,2,4,998,9
1,99,,2,4,"M",1029,,31,11,5,,1,"S",6,2012,"U",,"U","U",,,"J869",276,89,,37,3,1,1,"A415",2,1,"J939",3,1,"J869",,,,,,,,,,,,,,,,,,,,,,,,,,,,,,,,,,,,,,,,,,,,,,,,,,,,3,"J869","A415","J939",,,,,,,,,,,,,,,,,,8,,,2,4,998,9
1,99,,2,4,"F",1081,,42,22,10,,3,"W",7,2012,"U",,"U","U",,,"I10",206,69,,23,2,1,1,"I10",1,2,"E119",,,,,,,,,,,,,,,,,,,,,,,,,,,,,,,,,,,,,,,,,,,,,,,,,,,,,,,2,"I10","E119",,,,,,,,,,,,,,,,,,,8,,,2,4,998,9
1,99,,2,4,"F",1083,,42,22,10,,3,"W",4,2012,"U",,"U","U",,,"I10",206,69,,23,6,1,1,"I469",1,2,"R092",2,1,"I48",3,1,"I10",6,1,"I714",6,2,"R54",,,,,,,,,,,,,,,,,,,,,,,,,,,,,,,,,,,,,,,,,,,6,"I10","I469","I48","I714","R092","R54",,,,,,,,,,,,,,,8,,,2,4,998,9
1,99,,2,4,"F",1052,,36,16,7,,2,"S",4,2012,"U",,"U","U",,,"I500",230,67,,22,8,1,1,"I499",1,2,"I509",2,1,"J189",3,1,"I499",4,1,"J969",5,1,"I500",6,1,"E668",6,2,"G473",,,,,,,,,,,,,,,,,,,,,,,,,,,,,,,,,,,,,6,"I500","E668","G473","I499","J189","J969",,,,,,,,,,,,,,,8,,,2,4,998,9
1,99,,2,4,"M",1071,,40,20,9,,1,"D",6,2012,"U",,"U","U",,,"I219",211,59,,21,5,1,1,"I219",2,1,"I251",6,1,"C931",6,2,"L97",6,3,"A419",,,,,,,,,,,,,,,,,,,,,,,,,,,,,,,,,,,,,,,,,,,,,,5,"I219","A419","C931","I251","L97",,,,,,,,,,,,,,,,1,,,1,1,998,9
1,99,,2,4,"F",1084,,42,22,10,,1,"W",6,2012,"U",,"U","U",,,"I499",228,68,,22,5,1,1,"I469",2,1,"I499",6,1,"I64",6,2,"E149",6,3,"I10",,,,,,,,,,,,,,,,,,,,,,,,,,,,,,,,,,,,,,,,,,,,,,5,"I499","E149","I10","I469","I64",,,,,,,,,,,,,,,,8,,,2,4,998,9
1,99,,2,4,"M",1058,,37,17,8,,2,"M",1,2012,"U",,"U","U",,,"E149",159,46,,16,5,1,1,"I499",2,1,"E149",2,2,"I10",2,3,"N185",6,1,"C349",,,,,,,,,,,,,,,,,,,,,,,,,,,,,,,,,,,,,,,,,,,,,,5,"E149","C349","I10","I499","N185",,,,,,,,,,,,,,,,8,,,2,4,998,9
1,99,,2,4,"M",1066,,39,19,9,,1,"M",3,2012,"U",,"U","U",,,"I64",238,70,,24,3,1,1,"R048",2,1,"J189",3,1,"I64",,,,,,,,,,,,,,,,,,,,,,,,,,,,,,,,,,,,,,,,,,,,,,,,,,,,3,"I64","J189","R048",,,,,,,,,,,,,,,,,,8,,,2,4,998,9
1,99,,2,4,"M",4004,,6,1,1,6,1,"S",3,2012,"U",,"U","U",,,"P059",364,108,87,33,3,1,1,"P285",2,1,"J860",3,1,"P059",,,,,,,,,,,,,,,,,,,,,,,,,,,,,,,,,,,,,,,,,,,,,,,,,,,,3,"P059","J860","P285",,,,,,,,,,,,,,,,,,8,,,2,4,998,9
1,99,,2,4,"F",1082,,42,22,10,,3,"W",4,2012,"U",,"U","U",,,"E119",159,46,,16,5,1,1,"A419",2,1,"L899",3,1,"E119",3,2,"I10",6,1,"R54",,,,,,,,,,,,,,,,,,,,,,,,,,,,,,,,,,,,,,,,,,,,,,5,"E119","A419","I10","L899","R54",,,,,,,,,,,,,,,,8,,,2,4,998,9
1,99,,2,4,"F",1082,,42,22,10,,3,"M",4,2012,"U",,"U","U",,,"E149",159,46,,16,6,1,1,"R092",2,1,"I64",3,1,"E149",6,1,"I10",6,2,"R54",6,3,"R263",,,,,,,,,,,,,,,,,,,,,,,,,,,,,,,,,,,,,,,,,,,6,"E149","I10","I64","R092","R263","R54",,,,,,,,,,,,,,,8,,,2,4,998,9
1,99,,2,4,"F",1030,,32,12,5,,3,"M",5,2012,"U",,"U","U",,,"I219",211,59,,21,3,1,1,"I469",2,1,"R000",3,1,"I219",,,,,,,,,,,,,,,,,,,,,,,,,,,,,,,,,,,,,,,,,,,,,,,,,,,,3,"I219","I469","R000",,,,,,,,,,,,,,,,,,8,,,2,4,998,9
1,99,,2,4,"M",1080,,42,22,10,,3,"W",7,2012,"U",,"U","U",,,"C349",93,27,,8,2,1,1,"C349",6,1,"R54",,,,,,,,,,,,,,,,,,,,,,,,,,,,,,,,,,,,,,,,,,,,,,,,,,,,,,,2,"C349","R54",,,,,,,,,,,,,,,,,,,8,,,2,4,998,9
1,99,,2,5,"M",1072,,40,20,9,,1,"M",5,2012,"U",,"U","N",,,"E145",159,46,,16,14,1,1,"A419",1,2,"I500",1,3,"K767",2,1,"E145",2,2,"A419",2,3,"I739",2,4,"I259",2,5,"I10",2,6,"I48",2,7,"N189",2,8,"B169",6,1,"K922",6,2,"N288",6,3,"I694",,,,,,,,,,,,,,,,,,,13,"E145","A419","B169","I10","I259","I48","I500","I694","I739","K767","K922","N189","N288",,,,,,,,8,,,2,4,998,9