"restatus","educ1989","educ2003","educflag","monthdth","sex","age","ageflag","ager52","ager27","ager12","ager22","placdth","marstat","weekday","year","injwork","mandeath","methdisp","autopsy","activity","injury","ucod","ucr358","ucr113","ucr130","ucr39","eanum","econdp_1","econds_1","enicon_1","econdp_2","econds_2","enicon_2","econdp_3","econds_3","enicon_3","econdp_4","econds_4","enicon_4","econdp_5","econds_5","enicon_5","econdp_6","econds_6","enicon_6","econdp_7","econds_7","enicon_7","econdp_8","econds_8","enicon_8","econdp_9","econds_9","enicon_9","econdp_10","econds_10","enicon_10","econdp_11","econds_11","enicon_11","econdp_12","econds_12","enicon_12","econdp_13","econds_13","enicon_13","econdp_14","econds_14","enicon_14","econdp_15","econds_15","enicon_15","econdp_16","econds_16","enicon_16","econdp_17","econds_17","enicon_17","econdp_18","econds_18","enicon_18","econdp_19","econds_19","enicon_19","econdp_20","econds_20","enicon_20","ranum","record_1","record_2","record_3","record_4","record_5","record_6","record_7","record_8","record_9","record_10","record_11","record_12","record_13","record_14","record_15","record_16","record_17","record_18","record_19","record_20","race","brace","raceimp","racer3","racer5","hispanic","hspanicr"
1,99,,2,1,"M",1054,,36,16,7,,3,"M",6,2009,"U",,"U","N",,,"M100",313,111,,37,1,6,1,"M100",,,,,,,,,,,,,,,,,,,,,,,,,,,,,,,,,,,,,,,,,,,,,,,,,,,,,,,,,,1,"M100",,,,,,,,,,,,,,,,,,,,8,,,2,4,998,9
1,99,,2,1,"M",1049,,35,15,7,,3,"M",6,2009,"U",,"U","N",,,"R99",379,110,,36,1,1,1,"R99",,,,,,,,,,,,,,,,,,,,,,,,,,,,,,,,,,,,,,,,,,,,,,,,,,,,,,,,,,1,"R99",,,,,,,,,,,,,,,,,,,,8,,,2,4,998,9
1,99,,2,1,"M",1076,,41,21,10,,1,"W",6,2009,"U",,"U","N",,,"C301",91,43,,15,5,1,1,"I64",2,1,"C301",2,2,"C794",6,1,"H71",6,2,"R54",,,,,,,,,,,,,,,,,,,,,,,,,,,,,,,,,,,,,,,,,,,,,,5,"C301","C794","H71","I64","R54",,,,,,,,,,,,,,,,8,,,2,4,998,9
1,99,,2,1,"F",1076,,41,21,10,,1,"M",1,2009,"U",,"U","N",,,"A410",23,10,,37,11,1,1,"A410",2,1,"J189",2,2,"A419",3,1,"J960",6,1,"F179",6,2,"N390",6,3,"M139",6,4,"R99",6,5,"R945",6,6,"B370",6,7,"E669",,,,,,,,,,,,,,,,,,,,,,,,,,,,10,"A410","B370","E669","F179","J189","J960","M139","N390","R945","R99",,,,,,,,,,,8,,,2,4,998,9
1,99,,2,1,"F",1079,,41,21,10,,3,"W",2,2009,"U",,"U","N",,,"E149",159,46,,16,3,2,1,"I500",3,1,"E149",4,1,"E785",,,,,,,,,,,,,,,,,,,,,,,,,,,,,,,,,,,,,,,,,,,,,,,,,,,,3,"E149","E785","I500",,,,,,,,,,,,,,,,,,8,,,2,4,998,9
1,99,,2,1,"M",1072,,40,20,9,,1,"S",4,2009,"U",,"U","N",,,"I619",236,70,,24,2,1,1,"I619",2,1,"I10",,,,,,,,,,,,,,,,,,,,,,,,,,,,,,,,,,,,,,,,,,,,,,,,,,,,,,,2,"I619","I10",,,,,,,,,,,,,,,,,,,8,,,2,4,998,9
1,99,,2,1,"F",4027,,11,1,1,11,1,"S",3,2009,"U",,"U","N",,,"P290",364,108,117,33,3,1,1,"P219",2,1,"P290",3,1,"Q249",,,,,,,,,,,,,,,,,,,,,,,,,,,,,,,,,,,,,,,,,,,,,,,,,,,,3,"P290","P219","Q249",,,,,,,,,,,,,,,,,,8,,,2,4,998,9
1,99,,2,1,"M",1057,,37,17,8,,1,"M",5,2009,"U",,"U","N",9,9,"W19",406,118,,39,5,1,1,"I219",2,1,"I269",3,1,"S062",4,1,"W19",6,1,"E109",,,,,,,,,,,,,,,,,,,,,,,,,,,,,,,,,,,,,,,,,,,,,,5,"W19","E109","I219","I269","S062",,,,,,,,,,,,,,,,8,,,2,4,998,9
1,99,,2,1,"F",1092,,44,24,11,,3,"M",6,2009,"U",,"U","N",,,"I10",206,69,,23,1,6,1,"I10",,,,,,,,,,,,,,,,,,,,,,,,,,,,,,,,,,,,,,,,,,,,,,,,,,,,,,,,,,1,"I10",,,,,,,,,,,,,,,,,,,,8,,,2,4,998,9
1,99,,2,1,"M",1056,,37,17,8,,3,"M",1,2009,"U",,"U","N",,,"I10",206,69,,23,1,1,1,"I10",,,,,,,,,,,,,,,,,,,,,,,,,,,,,,,,,,,,,,,,,,,,,,,,,,,,,,,,,,1,"I10",,,,,,,,,,,,,,,,,,,,8,,,2,4,998,9
1,99,,2,1,"M",1066,,39,19,9,,3,"M",4,2009,"U",,"U","N",,,"E119",159,46,,16,5,1,1,"I64",2,1,"E119",3,1,"I500",6,1,"I517",6,2,"N189",,,,,,,,,,,,,,,,,,,,,,,,,,,,,,,,,,,,,,,,,,,,,,5,"E119","I500","I517","I64","N189",,,,,,,,,,,,,,,,8,,,2,4,998,9
1,99,,2,1,"M",1086,,43,23,11,,1,"W",5,2009,"U",,"U","N",,9,"C349",93,27,,8,5,1,1,"R092",2,1,"T179",2,2,"W80",3,1,"C349",4,1,"J449",,,,,,,,,,,,,,,,,,,,,,,,,,,,,,,,,,,,,,,,,,,,,,5,"C349","J449","R092","T179","W80",,,,,,,,,,,,,,,,8,,,2,4,998,9
1,99,,2,1,"M",2001,,12,2,1,12,3,"S",2,2009,"U",,"U","Y",,9,"Q250",370,109,124,34,8,1,1,"R090",2,1,"I272",2,2,"R048",2,3,"J840",2,4,"T179",2,5,"W78",3,1,"Q250",3,2,"I517",,,,,,,,,,,,,,,,,,,,,,,,,,,,,,,,,,,,,8,"Q250","I272","I517","J840","R048","R090","T179","W78",,,,,,,,,,,,,8,,,2,4,998,9
1,99,,2,1,"M",1038,,33,13,6,,1,"S",4,2009,"U",,"U","N",,,"A415",23,10,,37,12,1,1,"A415",2,1,"N390",2,2,"J189",3,1,"A419",4,1,"R688",6,1,"R068",6,2,"I219",6,3,"E119",6,4,"I10",6,5,"I00",6,6,"I330",6,7,"I64",,,,,,,,,,,,,,,,,,,,,,,,,11,"A415","E119","I00","I10","I219","I330","I64","J189","N390","R068","R688",,,,,,,,,,8,,,2,4,998,9
1,99,,2,1,"M",1078,,41,21,10,,1,"W",1,2009,"U",,"U","N",,,"C169",78,22,,5,3,1,1,"K922",2,1,"C169",3,1,"J449",,,,,,,,,,,,,,,,,,,,,,,,,,,,,,,,,,,,,,,,,,,,,,,,,,,,3,"C169","J449","K922",,,,,,,,,,,,,,,,,,8,,,2,4,998,9
1,99,,2,1,"F",1031,,32,12,5,,1,"M",1,2009,"U",,"U","N",,,"O268",352,107,,32,9,1,1,"O995",2,1,"O988",3,1,"O268",3,2,"O995",6,1,"O268",6,2,"O990",6,3,"O992",6,4,"O994",6,5,"O985",,,,,,,,,,,,,,,,,,,,,,,,,,,,,,,,,,1,"O268",,,,,,,,,,,,,,,,,,,,8,,,2,4,998,9
1,99,,2,1,"F",1060,,38,18,8,,2,"W",2,2009,"U",,"U","N",,,"E119",159,46,,16,2,1,1,"E119",2,1,"I10",,,,,,,,,,,,,,,,,,,,,,,,,,,,,,,,,,,,,,,,,,,,,,,,,,,,,,,2,"E119","I10",,,,,,,,,,,,,,,,,,,8,,,2,4,998,9
1,99,,2,1,"F",1089,,43,23,11,,1,"W",2,2009,"U",,"U","N",,,"G932",194,111,,37,3,1,1,"I620",2,1,"I609",3,1,"G932",,,,,,,,,,,,,,,,,,,,,,,,,,,,,,,,,,,,,,,,,,,,,,,,,,,,3,"G932","I609","I620",,,,,,,,,,,,,,,,,,8,,,2,4,998,9
1,99,,2,1,"M",1059,,37,17,8,,1,"M",3,2009,"U",,"U","N",,,"K274",286,90,,29,6,1,1,"A410",2,1,"J189",2,2,"J969",3,1,"K922",6,1,"E119",6,2,"K279",,,,,,,,,,,,,,,,,,,,,,,,,,,,,,,,,,,,,,,,,,,5,"K274","A410","E119","J189","J969",,,,,,,,,,,,,,,,8,,,2,4,998,9
1,99,,2,1,"F",1048,,35,15,7,,3,"M",2,2009,"U",,"U","N",,,"C80",125,43,,15,2,1,1,"C798",2,1,"C780",,,,,,,,,,,,,,,,,,,,,,,,,,,,,,,,,,,,,,,,,,,,,,,,,,,,,,,3,"C80","C780","C798",,,,,,,,,,,,,,,,,,8,,,2,4,998,9
1,99,,2,1,"F",1062,,38,18,8,,3,"M",3,2009,"U",,"U","N",,,"I64",238,70,,24,3,1,1,"I64",1,2,"R568",2,1,"I10",,,,,,,,,,,,,,,,,,,,,,,,,,,,,,,,,,,,,,,,,,,,,,,,,,,,3,"I64","I10","R568",,,,,,,,,,,,,,,,,,8,,,2,4,998,9
1,99,,2,1,"M",1037,,33,13,6,,3,"M",1,2009,"U",,"U","N",,,"I500",230,67,,22,3,2,1,"I500",6,1,"I10",6,2,"E119",,,,,,,,,,,,,,,,,,,,,,,,,,,,,,,,,,,,,,,,,,,,,,,,,,,,3,"I500","E119","I10",,,,,,,,,,,,,,,,,,8,,,2,4,998,9
4,99,,2,1,"M",1054,,36,16,7,,7,"M",4,2009,"Y",,"U","Y",,,"I613",236,70,,24,3,1,1,"I613",2,1,"I672",3,1,"I10",,,,,,,,,,,,,,,,,,,,,,,,,,,,,,,,,,,,,,,,,,,,,,,,,,,,3,"I613","I10","I672",,,,,,,,,,,,,,,,,,8,,,2,4,998,9
1,99,,2,1,"M",1072,,40,20,9,,2,"M",2,2009,"U",,"U","N",,,"E149",159,46,,16,5,1,1,"I219",2,1,"E149",2,2,"I10",3,1,"I48",6,1,"I64",,,,,,,,,,,,,,,,,,,,,,,,,,,,,,,,,,,,,,,,,,,,,,5,"E149","I10","I219","I48","I64",,,,,,,,,,,,,,,,8,,,2,4,998,9
1,99,,2,1,"F",1055,,37,17,8,,1,"M",4,2009,"U",,"U","N",,,"C719",122,36,,15,6,1,1,"D432",2,1,"C719",2,2,"G932",2,3,"R568",6,1,"E119",6,2,"I64",,,,,,,,,,,,,,,,,,,,,,,,,,,,,,,,,,,,,,,,,,,5,"C719","E119","G932","I64","R568",,,,,,,,,,,,,,,,8,,,2,4,998,9
1,99,,2,1,"F",1078,,41,21,10,,1,"W",5,2009,"U",,"U","N",,,"I429",227,68,,22,11,1,1,"I429",2,1,"R99",3,1,"I500",6,1,"E119",6,2,"I10",6,3,"N189",6,4,"E669",6,5,"G473",6,6,"R068",6,7,"E790",6,8,"I48",,,,,,,,,,,,,,,,,,,,,,,,,,,,11,"I429","E119","E669","E790","G473","I10","I48","I500","N189","R068","R99",,,,,,,,,,8,,,2,4,998,9
1,99,,2,1,"F",1066,,39,19,9,,1,"M",7,2009,"U",,"U","N",,,"E878",172,111,,37,7,1,1,"N179",1,2,"N189",2,1,"K631",3,1,"E878",6,1,"E835",6,2,"E039",6,3,"R945",,,,,,,,,,,,,,,,,,,,,,,,,,,,,,,,,,,,,,,,7,"E878","E039","E835","K631","N179","N189","R945",,,,,,,,,,,,,,8,,,2,4,998,9
1,99,,2,1,"F",1053,,36,16,7,,3,"W",2,2009,"U",,"U","N",,,"C229",85,24,,15,3,2,1,"C229",2,2,"C80",3,1,"N189",,,,,,,,,,,,,,,,,,,,,,,,,,,,,,,,,,,,,,,,,,,,,,,,,,,,2,"C229","N189",,,,,,,,,,,,,,,,,,,8,,,2,4,998,9
1,99,,2,1,"F",1075,,41,21,10,,3,"W",6,2009,"U",,"U","N",,,"C762",125,43,,15,7,1,1,"T818",2,1,"Y836",2,2,"K639",3,1,"C762",6,1,"E149",6,2,"I10",6,3,"E785",,,,,,,,,,,,,,,,,,,,,,,,,,,,,,,,,,,,,,,,7,"C762","E149","E785","I10","K639","T818","Y836",,,,,,,,,,,,,,8,,,2,4,998,9
1,99,,2,1,"M",1071,,40,20,9,,3,"W",6,2009,"U",,"U","N",,,"E109",159,46,,16,3,2,1,"I251",3,1,"E109",3,2,"I10",,,,,,,,,,,,,,,,,,,,,,,,,,,,,,,,,,,,,,,,,,,,,,,,,,,,3,"E109","I10","I251",,,,,,,,,,,,,,,,,,8,,,2,4,998,9
1,99,,2,2,"M",1067,,39,19,9,,1,"M",1,2009,"U",,"U","N",,,"I219",211,59,,21,5,1,1,"I219",2,1,"I500",6,1,"J189",6,2,"E149",6,3,"I10",,,,,,,,,,,,,,,,,,,,,,,,,,,,,,,,,,,,,,,,,,,,,,5,"I219","E149","I10","I500","J189",,,,,,,,,,,,,,,,8,,,2,4,998,9
1,99,,2,2,"M",1053,,36,16,7,,1,"M",1,2009,"U",,"U","N",,,"I219",211,59,,21,7,1,1,"I219",2,1,"R570",6,1,"J81",6,2,"I500",6,3,"E119",6,4,"I10",6,5,"E785",,,,,,,,,,,,,,,,,,,,,,,,,,,,,,,,,,,,,,,,7,"I219","E119","E785","I10","I500","J81","R570",,,,,,,,,,,,,,8,,,2,4,998,9
1,99,,2,2,"M",1060,,38,18,8,,3,"M",2,2009,"U",,"U","N",,,"C61",113,33,,11,4,1,1,"R092",2,1,"C780",3,1,"C61",4,1,"D649",,,,,,,,,,,,,,,,,,,,,,,,,,,,,,,,,,,,,,,,,,,,,,,,,4,"C61","C780","D649","R092",,,,,,,,,,,,,,,,,8,,,2,4,998,9
1,99,,2,2,"F",1057,,37,17,8,,1,"M",6,2009,"U",,"U","N",,,"C55",108,31,,10,2,1,1,"R092",2,1,"C55",,,,,,,,,,,,,,,,,,,,,,,,,,,,,,,,,,,,,,,,,,,,,,,,,,,,,,,2,"C55","R092",,,,,,,,,,,,,,,,,,,8,,,2,4,998,9
1,99,,2,2,"F",1042,,34,14,6,,1,"M",3,2009,"U",,"U","N",,,"E668",169,111,,37,9,1,1,"A419",1,2,"M726",2,1,"I500",3,1,"E668",6,1,"E149",6,2,"I10",6,3,"N189",6,4,"G473",6,5,"J969",,,,,,,,,,,,,,,,,,,,,,,,,,,,,,,,,,9,"E668","A419","E149","G473","I10","I500","J969","M726","N189",,,,,,,,,,,,8,,,2,4,998,9
1,99,,2,2,"M",2004,,15,2,1,15,3,"S",1,2009,"U",,"U","U",,,"J988",278,89,62,37,2,2,1,"R090",3,1,"J988",,,,,,,,,,,,,,,,,,,,,,,,,,,,,,,,,,,,,,,,,,,,,,,,,,,,,,,2,"J988","R090",,,,,,,,,,,,,,,,,,,8,,,2,4,998,9
1,99,,2,2,"M",1048,,35,15,7,,3,"M",2,2009,"Y",1,"U","Y",9,8,"W74",409,120,,39,8,1,1,"G931",2,1,"S223",2,2,"T179",2,3,"W80",3,1,"T751",3,2,"W74",6,1,"J948",6,2,"J439",,,,,,,,,,,,,,,,,,,,,,,,,,,,,,,,,,,,,8,"W74","G931","J439","J948","S223","T179","T751","W80",,,,,,,,,,,,,8,,,2,4,998,9
1,99,,2,2,"F",1079,,41,21,10,,1,"W",7,2009,"U",,"U","N",,,"A419",23,10,,37,3,1,1,"I64",2,1,"J189",3,1,"A419",,,,,,,,,,,,,,,,,,,,,,,,,,,,,,,,,,,,,,,,,,,,,,,,,,,,3,"A419","I64","J189",,,,,,,,,,,,,,,,,,8,,,2,4,998,9
1,99,,2,2,"M",1022,,30,10,4,,3,"S",1,2009,"U",,"U","N",9,9,"W74",409,120,,39,2,1,1,"T751",1,2,"W74",,,,,,,,,,,,,,,,,,,,,,,,,,,,,,,,,,,,,,,,,,,,,,,,,,,,,,,2,"W74","T751",,,,,,,,,,,,,,,,,,,8,,,2,4,998,9
1,99,,2,2,"M",1055,,37,17,8,,3,"M",2,2009,"U",,"U","N",,,"E119",159,46,,16,2,2,1,"N19",3,1,"E119",,,,,,,,,,,,,,,,,,,,,,,,,,,,,,,,,,,,,,,,,,,,,,,,,,,,,,,2,"E119","N19",,,,,,,,,,,,,,,,,,,8,,,2,4,998,9
1,99,,2,2,"M",1070,,40,20,9,,3,"M",1,2009,"U",,"U","N",,,"I10",206,69,,23,1,2,1,"I10",,,,,,,,,,,,,,,,,,,,,,,,,,,,,,,,,,,,,,,,,,,,,,,,,,,,,,,,,,1,"I10",,,,,,,,,,,,,,,,,,,,8,,,2,4,998,9
1,99,,2,2,"M",1092,,44,24,11,,3,"W",5,2009,"U",,"U","U",,,"I10",206,69,,23,2,2,1,"I10",3,1,"D649",,,,,,,,,,,,,,,,,,,,,,,,,,,,,,,,,,,,,,,,,,,,,,,,,,,,,,,2,"I10","D649",,,,,,,,,,,,,,,,,,,8,,,2,4,998,9
1,99,,2,2,"F",1072,,40,20,9,,1,"W",6,2009,"U",,"U","N",,,"C259",88,25,,7,1,1,1,"C259",,,,,,,,,,,,,,,,,,,,,,,,,,,,,,,,,,,,,,,,,,,,,,,,,,,,,,,,,,1,"C259",,,,,,,,,,,,,,,,,,,,8,,,2,4,998,9
1,99,,2,2,"M",1053,,36,16,7,,1,"M",7,2009,"U",,"U","N",,,"A419",23,10,,37,4,1,1,"R688",2,1,"A419",6,1,"J181",6,2,"A279",,,,,,,,,,,,,,,,,,,,,,,,,,,,,,,,,,,,,,,,,,,,,,,,,4,"A419","A279","J181","R688",,,,,,,,,,,,,,,,,8,,,2,4,998,9
1,99,,2,2,"M",1089,,43,23,11,,3,"W",1,2009,"U",,"U","N",,,"C833",129,39,,13,1,1,1,"C833",,,,,,,,,,,,,,,,,,,,,,,,,,,,,,,,,,,,,,,,,,,,,,,,,,,,,,,,,,1,"C833",,,,,,,,,,,,,,,,,,,,8,,,2,4,998,9
1,99,,2,2,"F",1086,,43,23,11,,1,"W",1,2009,"U",,"U","N",,,"I48",228,68,,22,6,1,1,"J181",2,1,"I500",3,1,"I48",6,1,"M869",6,2,"D649",6,3,"N189",,,,,,,,,,,,,,,,,,,,,,,,,,,,,,,,,,,,,,,,,,,6,"I48","D649","I500","J181","M869","N189",,,,,,,,,,,,,,,8,,,2,4,998,9
1,99,,2,2,"F",1048,,35,15,7,,1,"M",4,2009,"U",,"U","N",,,"I429",227,68,,22,10,1,1,"I429",2,1,"I500",3,1,"R688",6,1,"I38",6,2,"I48",6,3,"N189",6,4,"K720",6,5,"E668",6,6,"G473",6,7,"N390",,,,,,,,,,,,,,,,,,,,,,,,,,,,,,,10,"I429","E668","G473","I38","I48","I500","K720","N189","N390","R688",,,,,,,,,,,8,,,2,4,998,9
1,99,,2,2,"M",1079,,41,21,10,,3,"M",5,2009,"U",,"U","N",,,"C349",93,27,,8,4,1,1,"R092",2,1,"C349",3,1,"C782",4,1,"D649",,,,,,,,,,,,,,,,,,,,,,,,,,,,,,,,,,,,,,,,,,,,,,,,,4,"C349","C782","D649","R092",,,,,,,,,,,,,,,,,8,,,2,4,998,9
1,99,,2,2,"M",1031,,32,12,5,,3,"M",2,2009,"Y",1,"U","Y",,,"I219",211,59,,21,1,1,1,"I219",,,,,,,,,,,,,,,,,,,,,,,,,,,,,,,,,,,,,,,,,,,,,,,,,,,,,,,,,,1,"I219",,,,,,,,,,,,,,,,,,,,8,,,2,4,998,9
1,99,,2,2,"M",1057,,37,17,8,,1,"M",5,2009,"U",,"U","N",,,"I48",228,68,,22,5,1,1,"T828",2,1,"Y831",3,1,"I48",6,1,"E149",6,2,"L089",,,,,,,,,,,,,,,,,,,,,,,,,,,,,,,,,,,,,,,,,,,,,,5,"I48","E149","L089","T828","Y831",,,,,,,,,,,,,,,,8,,,2,4,998,9
1,99,,2,2,"F",1028,,31,11,5,,1,"S",5,2009,"U",,"U","N",,,"A91",41,18,,37,2,1,1,"A91",2,1,"D696",,,,,,,,,,,,,,,,,,,,,,,,,,,,,,,,,,,,,,,,,,,,,,,,,,,,,,,2,"A91","D696",,,,,,,,,,,,,,,,,,,8,,,2,4,998,9
1,99,,2,2,"M",1040,,34,14,6,,7,"M",6,2009,"U",3,"U","Y",9,9,"Y09",441,129,,41,5,1,1,"S069",2,1,"S062",3,1,"T07",3,2,"Y09",3,3,"S224",,,,,,,,,,,,,,,,,,,,,,,,,,,,,,,,,,,,,,,,,,,,,,5,"Y09","S062","S069","S224","T07",,,,,,,,,,,,,,,,8,,,2,4,998,9
1,99,,2,3,"F",1001,,23,3,2,,3,"S",1,2009,"U",,"U","N",,,"J450",268,85,,28,3,1,1,"J969",2,1,"J450",3,1,"I420",,,,,,,,,,,,,,,,,,,,,,,,,,,,,,,,,,,,,,,,,,,,,,,,,,,,3,"J450","I420","J969",,,,,,,,,,,,,,,,,,8,,,2,4,998,9
1,99,,2,3,"M",1061,,38,18,8,,3,"M",1,2009,"U",,"U","N",,,"I219",211,59,,21,4,1,1,"I219",2,1,"N180",3,1,"I10",6,1,"E109",,,,,,,,,,,,,,,,,,,,,,,,,,,,,,,,,,,,,,,,,,,,,,,,,3,"I219","E109","I120",,,,,,,,,,,,,,,,,,8,,,2,4,998,9
1,99,,2,3,"F",1049,,35,15,7,,1,"W",2,2009,"U",,"U","N",,,"J189",257,78,,27,3,1,1,"I219",2,1,"J189",6,1,"E119",,,,,,,,,,,,,,,,,,,,,,,,,,,,,,,,,,,,,,,,,,,,,,,,,,,,3,"J189","E119","I219",,,,,,,,,,,,,,,,,,8,,,2,4,998,9
1,99,,2,3,"M",1056,,37,17,8,,2,"M",3,2009,"U",,"U","N",,,"I219",211,59,,21,1,1,1,"I219",,,,,,,,,,,,,,,,,,,,,,,,,,,,,,,,,,,,,,,,,,,,,,,,,,,,,,,,,,1,"I219",,,,,,,,,,,,,,,,,,,,8,,,2,4,998,9
1,99,,2,3,"M",1072,,40,20,9,,2,"M",3,2009,"U",,"U","N",,,"N180",327,100,,31,2,1,1,"A419",2,1,"N180",,,,,,,,,,,,,,,,,,,,,,,,,,,,,,,,,,,,,,,,,,,,,,,,,,,,,,,2,"N180","A419",,,,,,,,,,,,,,,,,,,8,,,2,4,998,9
1,99,,2,3,"M",1075,,41,21,10,,1,"W",4,2009,"U",,"U","N",,,"K801",302,96,,37,4,1,1,"A419",2,1,"K819",3,1,"K802",6,1,"I48",,,,,,,,,,,,,,,,,,,,,,,,,,,,,,,,,,,,,,,,,,,,,,,,,3,"K801","A419","I48",,,,,,,,,,,,,,,,,,8,,,2,4,998,9
1,99,,2,3,"M",1062,,38,18,8,,1,"M",5,2009,"U",,"U","N",,,"J440",267,86,,28,4,1,1,"J969",2,1,"J449",3,1,"J189",4,1,"I10",,,,,,,,,,,,,,,,,,,,,,,,,,,,,,,,,,,,,,,,,,,,,,,,,3,"J440","I10","J969",,,,,,,,,,,,,,,,,,8,,,2,4,998,9
1,99,,2,3,"M",1057,,37,17,8,,1,"S",5,2009,"U",,"U","N",,,"C349",93,27,,8,10,1,1,"C349",2,1,"J960",6,1,"J189",6,2,"N179",6,3,"F179",6,4,"D649",6,5,"D696",6,6,"R99",6,7,"E790",6,8,"B909",,,,,,,,,,,,,,,,,,,,,,,,,,,,,,,10,"C349","B909","D649","D696","E790","F179","J189","J960","N179","R99",,,,,,,,,,,8,,,2,4,998,9
1,99,,2,3,"F",1081,,42,22,10,,1,"M",5,2009,"U",,"U","N",,,"Y839",456,135,,39,12,1,1,"T814",1,2,"L89",1,3,"J189",2,1,"R688",6,1,"I48",6,2,"I500",6,3,"N189",6,4,"J449",6,5,"I10",6,6,"G822",6,7,"M480",6,8,"Y839",,,,,,,,,,,,,,,,,,,,,,,,,11,"Y839","G822","I10","I48","I500","J440","L89","M480","N189","R688","T814",,,,,,,,,,8,,,2,4,998,9
1,99,,2,3,"M",1021,,30,10,4,,1,"S",6,2009,"U",,"U","N",,,"J459",268,85,,28,4,1,1,"J459",1,2,"J980",3,1,"I609",6,1,"J189",,,,,,,,,,,,,,,,,,,,,,,,,,,,,,,,,,,,,,,,,,,,,,,,,4,"J459","I609","J189","J980",,,,,,,,,,,,,,,,,8,,,2,4,998,9
1,99,,2,3,"F",1060,,38,18,8,,3,"M",6,2009,"U",,"U","Y",9,9,"W78",410,123,,39,6,1,1,"T179",1,2,"W78",2,1,"T179",6,1,"J449",6,2,"J948",6,3,"J939",,,,,,,,,,,,,,,,,,,,,,,,,,,,,,,,,,,,,,,,,,,5,"W78","J449","J939","J948","T179",,,,,,,,,,,,,,,,8,,,2,4,998,9
1,99,,2,3,"M",1043,,34,14,6,,3,"M",7,2009,"N",,"U","Y",,,"I251",215,63,,21,4,1,1,"I461",2,1,"I251",2,2,"I38",6,1,"J841",,,,,,,,,,,,,,,,,,,,,,,,,,,,,,,,,,,,,,,,,,,,,,,,,4,"I251","I38","I461","J841",,,,,,,,,,,,,,,,,8,,,2,4,998,9
1,99,,2,3,"M",1066,,39,19,9,,1,"M",2,2009,"U",,"U","N",,,"J449",267,86,,28,2,1,1,"J969",2,1,"J449",,,,,,,,,,,,,,,,,,,,,,,,,,,,,,,,,,,,,,,,,,,,,,,,,,,,,,,2,"J449","J969",,,,,,,,,,,,,,,,,,,1,,,1,1,998,9
1,99,,2,3,"M",1055,,37,17,8,,3,"M",3,2009,"U",,"U","N",,,"I120",208,69,,23,2,1,1,"N180",2,1,"I10",,,,,,,,,,,,,,,,,,,,,,,,,,,,,,,,,,,,,,,,,,,,,,,,,,,,,,,1,"I120",,,,,,,,,,,,,,,,,,,,8,,,2,4,998,9
1,99,,2,3,"M",2001,,12,2,1,12,1,"S",4,2009,"U",,"U","N",,,"P239",362,108,98,33,1,1,1,"P239",,,,,,,,,,,,,,,,,,,,,,,,,,,,,,,,,,,,,,,,,,,,,,,,,,,,,,,,,,1,"P239",,,,,,,,,,,,,,,,,,,,8,,,2,4,998,9
1,99,,2,3,"M",1069,,39,19,9,,1,"M",1,2009,"U",,"U","N",,,"E149",159,46,,16,6,1,1,"I219",2,1,"A419",3,1,"E149",6,1,"G939",6,2,"I500",6,3,"I48",,,,,,,,,,,,,,,,,,,,,,,,,,,,,,,,,,,,,,,,,,,6,"E149","A419","G939","I219","I48","I500",,,,,,,,,,,,,,,8,,,2,4,998,9
1,99,,2,3,"M",1061,,38,18,8,,2,"M",3,2009,"U",,"U","N",,,"E119",159,46,,16,4,1,1,"I219",2,1,"I10",3,1,"E119",6,1,"E785",,,,,,,,,,,,,,,,,,,,,,,,,,,,,,,,,,,,,,,,,,,,,,,,,4,"E119","E785","I10","I219",,,,,,,,,,,,,,,,,8,,,2,4,998,9
1,99,,2,3,"M",1074,,40,20,9,,3,"W",4,2009,"U",,"U","N",,,"C269",89,43,,15,7,1,1,"R18",1,2,"K759",2,1,"C269",2,2,"C80",3,1,"E149",3,2,"I10",6,1,"D649",,,,,,,,,,,,,,,,,,,,,,,,,,,,,,,,,,,,,,,,6,"C269","D649","E149","I10","K759","R18",,,,,,,,,,,,,,,8,,,2,4,998,9
1,99,,2,3,"F",1075,,41,21,10,,2,"M",6,2009,"U",,"U","N",,9,"J449",267,86,,28,11,1,1,"J960",2,1,"J449",2,2,"T179",6,1,"E119",6,2,"I500",6,3,"I48",6,4,"I10",6,5,"N189",6,6,"M109",6,7,"I694",6,8,"W80",,,,,,,,,,,,,,,,,,,,,,,,,,,,11,"J449","E119","I10","I48","I500","I694","J960","M109","N189","T179","W80",,,,,,,,,,8,,,2,4,998,9
1,99,,2,3,"M",1073,,40,20,9,,2,"M",7,2009,"U",,"U","N",,,"I718",242,73,,26,7,1,1,"I718",6,1,"N179",6,2,"E872",6,3,"A099",6,4,"M100",6,5,"E669",6,6,"E785",,,,,,,,,,,,,,,,,,,,,,,,,,,,,,,,,,,,,,,,7,"I718","A099","E669","E785","E872","M100","N179",,,,,,,,,,,,,,8,,,2,4,998,9
4,99,,2,3,"M",1077,,41,21,10,,3,"W",7,2009,"U",,"U","N",,,"R99",379,110,,36,1,1,1,"R99",,,,,,,,,,,,,,,,,,,,,,,,,,,,,,,,,,,,,,,,,,,,,,,,,,,,,,,,,,1,"R99",,,,,,,,,,,,,,,,,,,,8,,,2,4,998,9
1,99,,2,3,"M",1074,,40,20,9,,3,"W",1,2009,"U",,"U","N",,,"I219",211,59,,21,4,1,1,"I219",2,1,"I10",3,1,"N180",6,1,"E149",,,,,,,,,,,,,,,,,,,,,,,,,,,,,,,,,,,,,,,,,,,,,,,,,3,"I219","E149","I120",,,,,,,,,,,,,,,,,,8,,,2,4,998,9
1,99,,2,3,"M",1049,,35,15,7,,3,"M",2,2009,"U",,"U","N",,,"I219",211,59,,21,5,1,1,"I219",2,1,"I119",3,1,"I500",6,1,"I48",6,2,"N19",,,,,,,,,,,,,,,,,,,,,,,,,,,,,,,,,,,,,,,,,,,,,,3,"I219","I132","I48",,,,,,,,,,,,,,,,,,8,,,2,4,998,9
1,99,,2,3,"M",1081,,42,22,10,,1,"M",3,2009,"U",,"U","N",,,"E149",159,46,,16,3,1,1,"I64",2,1,"I10",3,1,"E149",,,,,,,,,,,,,,,,,,,,,,,,,,,,,,,,,,,,,,,,,,,,,,,,,,,,3,"E149","I10","I64",,,,,,,,,,,,,,,,,,8,,,2,4,998,9
1,99,,2,3,"F",5022,,2,1,1,2,1,"S",3,2009,"U",,"U","N",,,"P220",361,108,96,33,3,1,1,"P220",2,1,"P072",3,1,"P073",,,,,,,,,,,,,,,,,,,,,,,,,,,,,,,,,,,,,,,,,,,,,,,,,,,,1,"P220",,,,,,,,,,,,,,,,,,,,8,,,2,4,998,9
1,99,,2,3,"F",1052,,36,16,7,,2,"D",5,2009,"U",,"U","U",,,"I219",211,59,,21,4,1,1,"I219",2,1,"I10",3,1,"I251",6,1,"I500",,,,,,,,,,,,,,,,,,,,,,,,,,,,,,,,,,,,,,,,,,,,,,,,,4,"I219","I10","I251","I500",,,,,,,,,,,,,,,,,8,,,2,4,998,9
1,99,,2,3,"F",1043,,34,14,6,,1,"M",6,2009,"U",,"U","N",,,"I619",236,70,,24,9,1,1,"I10",2,1,"I619",2,2,"J960",6,1,"I119",6,2,"I499",6,3,"J690",6,4,"N179",6,5,"E785",6,6,"E790",,,,,,,,,,,,,,,,,,,,,,,,,,,,,,,,,,9,"I619","E785","E790","I10","I119","I499","J690","J960","N179",,,,,,,,,,,,8,,,2,4,998,9
1,99,,2,3,"M",1052,,36,16,7,,2,"M",6,2009,"U",,"U","N",,,"E109",159,46,,16,6,1,1,"I500",2,1,"E109",3,1,"I10",3,2,"E790",6,1,"M549",6,2,"N508",,,,,,,,,,,,,,,,,,,,,,,,,,,,,,,,,,,,,,,,,,,6,"E109","E790","I10","I500","M549","N508",,,,,,,,,,,,,,,8,,,2,4,998,9
1,99,,2,3,"F",1073,,40,20,9,,1,"W",7,2009,"U",,"U","N",,,"I120",208,69,,23,6,1,1,"I64",2,1,"A419",3,1,"N189",6,1,"E149",6,2,"I10",6,3,"D649",,,,,,,,,,,,,,,,,,,,,,,,,,,,,,,,,,,,,,,,,,,7,"I120","A419","D649","E149","I10","I64","N189",,,,,,,,,,,,,,8,,,2,4,998,9
1,99,,2,3,"M",1079,,41,21,10,,1,"S",7,2009,"U",,"U","N",,9,"K922",306,111,,37,7,1,1,"K922",2,1,"R99",3,1,"T179",3,2,"W80",3,3,"J81",4,1,"J960",6,1,"J189",,,,,,,,,,,,,,,,,,,,,,,,,,,,,,,,,,,,,,,,7,"K922","J189","J81","J960","R99","T179","W80",,,,,,,,,,,,,,8,,,2,4,998,9
1,99,,2,3,"M",1091,,44,24,11,,1,"S",1,2009,"U",,"U","N",,,"C61",113,33,,11,8,1,1,"C61",1,2,"C780",1,3,"C793",2,1,"N390",6,1,"I639",6,2,"R568",6,3,"I48",6,4,"L023",,,,,,,,,,,,,,,,,,,,,,,,,,,,,,,,,,,,,8,"C61","C780","C793","I48","I639","L023","N390","R568",,,,,,,,,,,,,8,,,2,4,998,9
1,99,,2,4,"M",1064,,38,18,8,,2,"M",5,2009,"U",,"U","N",,,"I219",211,59,,21,5,1,1,"I219",6,1,"E119",6,2,"J449",6,3,"J189",6,4,"F179",,,,,,,,,,,,,,,,,,,,,,,,,,,,,,,,,,,,,,,,,,,,,,4,"I219","E119","F179","J440",,,,,,,,,,,,,,,,,8,,,2,4,998,9
1,99,,2,4,"M",1052,,36,16,7,,3,"M",6,2009,"Y",,"U","N",,,"I219",211,59,,21,3,1,1,"I499",2,1,"I219",3,1,"I10",,,,,,,,,,,,,,,,,,,,,,,,,,,,,,,,,,,,,,,,,,,,,,,,,,,,3,"I219","I10","I499",,,,,,,,,,,,,,,,,,8,,,2,4,998,9
1,99,,2,4,"F",1089,,43,23,11,,3,"W",2,2009,"U",,"U","U",,,"I64",238,70,,24,4,2,1,"I64",3,1,"I10",6,1,"N189",6,2,"R54",,,,,,,,,,,,,,,,,,,,,,,,,,,,,,,,,,,,,,,,,,,,,,,,,4,"I64","I10","N189","R54",,,,,,,,,,,,,,,,,8,,,2,4,998,9
1,99,,2,4,"M",1079,,41,21,10,,3,"W",2,2009,"U",,"U","N",,,"C61",113,33,,11,1,2,1,"C61",,,,,,,,,,,,,,,,,,,,,,,,,,,,,,,,,,,,,,,,,,,,,,,,,,,,,,,,,,1,"C61",,,,,,,,,,,,,,,,,,,,8,,,2,4,998,9
1,99,,2,4,"M",1051,,36,16,7,,1,"M",2,2009,"U",,"U","N",,,"E149",159,46,,16,9,1,1,"I219",2,1,"I500",3,1,"E149",6,1,"N189",6,2,"I10",6,3,"I64",6,4,"I517",6,5,"E668",6,6,"G473",,,,,,,,,,,,,,,,,,,,,,,,,,,,,,,,,,9,"E149","E668","G473","I10","I219","I500","I517","I64","N189",,,,,,,,,,,,8,,,2,4,998,9
1,99,,2,4,"M",1075,,41,21,10,,1,"M",3,2009,"U",,"U","N",,,"J189",257,78,,27,5,1,1,"A419",2,1,"J189",6,1,"K922",6,2,"E119",6,3,"I10",,,,,,,,,,,,,,,,,,,,,,,,,,,,,,,,,,,,,,,,,,,,,,5,"J189","A419","E119","I10","K922",,,,,,,,,,,,,,,,8,,,2,4,998,9
1,99,,2,4,"M",1101,,46,26,11,,3,"W",4,2009,"U",,"U","N",,,"R54",376,110,,36,1,1,1,"R54",,,,,,,,,,,,,,,,,,,,,,,,,,,,,,,,,,,,,,,,,,,,,,,,,,,,,,,,,,1,"R54",,,,,,,,,,,,,,,,,,,,8,,,2,4,998,9
1,99,,2,4,"M",1047,,35,15,7,,1,"M",6,2009,"U",,"U","U",,,"K746",300,95,,30,11,1,1,"K746",2,1,"K729",3,1,"L039",3,2,"A419",6,1,"N179",6,2,"N19",6,3,"D689",6,4,"D696",6,5,"K277",6,6,"E790",6,7,"M199",,,,,,,,,,,,,,,,,,,,,,,,,,,,10,"K746","A419","D689","D696","E790","K277","K729","L039","M199","N179",,,,,,,,,,,8,,,2,4,998,9
1,99,,2,4,"M",1047,,35,15,7,,3,"M",1,2009,"U",,"U","N",,,"E149",159,46,,16,2,2,1,"E149",3,1,"D649",,,,,,,,,,,,,,,,,,,,,,,,,,,,,,,,,,,,,,,,,,,,,,,,,,,,,,,2,"E149","D649",,,,,,,,,,,,,,,,,,,8,,,2,4,998,9
1,99,,2,4,"F",1069,,39,19,9,,1,"M",2,2009,"U",,"U","N",,,"I120",208,69,,23,6,1,1,"J189",2,1,"J90",3,1,"N180",6,1,"E119",6,2,"I10",6,3,"I500",,,,,,,,,,,,,,,,,,,,,,,,,,,,,,,,,,,,,,,,,,,5,"I120","E119","I500","J189","J90",,,,,,,,,,,,,,,,8,,,2,4,998,9
1,99,,2,4,"F",1083,,42,22,10,,1,"W",3,2009,"U",,"U","N",,,"I64",238,70,,24,5,1,1,"R092",2,1,"I64",6,1,"I10",6,2,"I48",6,3,"A419",,,,,,,,,,,,,,,,,,,,,,,,,,,,,,,,,,,,,,,,,,,,,,5,"I64","A419","I10","I48","R092",,,,,,,,,,,,,,,,8,,,2,4,998,9
1,99,,2,4,"M",1056,,37,17,8,,3,"M",4,2009,"U",,"U","N",,,"E149",159,46,,16,4,1,1,"I219",2,1,"I500",3,1,"E149",6,1,"J449",,,,,,,,,,,,,,,,,,,,,,,,,,,,,,,,,,,,,,,,,,,,,,,,,4,"E149","I219","I500","J449",,,,,,,,,,,,,,,,,8,,,2,4,998,9
1,99,,2,4,"M",1009,,27,7,3,,3,"S",4,2009,"U",1,"U","Y",9,9,"W76",411,123,,39,5,1,1,"T179",1,2,"W78",2,1,"T179",3,1,"T71",3,2,"W76",,,,,,,,,,,,,,,,,,,,,,,,,,,,,,,,,,,,,,,,,,,,,,4,"W76","T179","T71","W78",,,,,,,,,,,,,,,,,8,,,2,4,998,9
1,99,,2,4,"M",1065,,39,19,9,,3,"M",5,2009,"U",,"U","N",,,"E149",159,46,,16,3,1,1,"L089",1,2,"A419",2,1,"E149",,,,,,,,,,,,,,,,,,,,,,,,,,,,,,,,,,,,,,,,,,,,,,,,,,,,3,"E149","A419","L089",,,,,,,,,,,,,,,,,,8,,,2,4,998,9