"restatus","educ1989","educ2003","educflag","monthdth","sex","age","ageflag","ager52","ager27","ager12","ager22","placdth","marstat","weekday","year","injwork","mandeath","methdisp","autopsy","activity","injury","ucod","ucr358","ucr113","ucr130","ucr39","eanum","econdp_1","econds_1","enicon_1","econdp_2","econds_2","enicon_2","econdp_3","econds_3","enicon_3","econdp_4","econds_4","enicon_4","econdp_5","econds_5","enicon_5","econdp_6","econds_6","enicon_6","econdp_7","econds_7","enicon_7","econdp_8","econds_8","enicon_8","econdp_9","econds_9","enicon_9","econdp_10","econds_10","enicon_10","econdp_11","econds_11","enicon_11","econdp_12","econds_12","enicon_12","econdp_13","econds_13","enicon_13","econdp_14","econds_14","enicon_14","econdp_15","econds_15","enicon_15","econdp_16","econds_16","enicon_16","econdp_17","econds_17","enicon_17","econdp_18","econds_18","enicon_18","econdp_19","econds_19","enicon_19","econdp_20","econds_20","enicon_20","ranum","record_1","record_2","record_3","record_4","record_5","record_6","record_7","record_8","record_9","record_10","record_11","record_12","record_13","record_14","record_15","record_16","record_17","record_18","record_19","record_20","race","brace","raceimp","racer3","racer5","hispanic","hspanicr"
1,99,,2,1,"M",1060,,38,18,8,,1,"S",2,2008,"U",,"U","N",,,"K704",298,94,,30,4,1,1,"J690",2,1,"I850",3,1,"K729",6,1,"F102",,,,,,,,,,,,,,,,,,,,,,,,,,,,,,,,,,,,,,,,,,,,,,,,,3,"K704","I850","J690",,,,,,,,,,,,,,,,,,1,,,1,1,998,9
1,99,,2,1,"M",1059,,37,17,8,,3,"M",7,2008,"U",,"U","N",,,"I48",228,68,,22,11,1,1,"N180",2,1,"I500",2,2,"E877",6,1,"E119",6,2,"I10",6,3,"I48",6,4,"E669",6,5,"E785",6,6,"M109",6,7,"H540",6,8,"H669",,,,,,,,,,,,,,,,,,,,,,,,,,,,10,"I48","E119","E669","E785","E877","H540","H669","I120","I500","M109",,,,,,,,,,,8,,,2,4,998,9
1,99,,2,1,"F",1064,,38,18,8,,1,"W",2,2008,"U",,"U","N",,,"I619",236,70,,24,2,1,1,"I619",2,1,"I10",,,,,,,,,,,,,,,,,,,,,,,,,,,,,,,,,,,,,,,,,,,,,,,,,,,,,,,2,"I619","I10",,,,,,,,,,,,,,,,,,,8,,,2,4,998,9
1,99,,2,1,"F",1060,,38,18,8,,1,"M",2,2008,"U",,"U","N",,,"C169",78,22,,5,4,1,1,"C169",1,2,"C80",6,1,"J189",6,2,"D649",,,,,,,,,,,,,,,,,,,,,,,,,,,,,,,,,,,,,,,,,,,,,,,,,3,"C169","D649","J189",,,,,,,,,,,,,,,,,,8,,,2,4,998,9
1,99,,2,1,"M",2001,,12,2,1,12,1,"S",2,2008,"U",,"U","N",,,"D696",153,111,31,37,6,1,1,"A419",2,1,"G039",3,1,"D696",6,1,"E161",6,2,"R628",6,3,"D649",,,,,,,,,,,,,,,,,,,,,,,,,,,,,,,,,,,,,,,,,,,6,"D696","A419","D649","E161","G039","R628",,,,,,,,,,,,,,,4,,,2,4,998,9
1,99,,2,1,"M",1033,,32,12,5,,3,"M",6,2008,"U",,"U","N",,,"I38",226,68,,22,5,1,1,"R99",2,1,"I38",2,2,"I429",2,3,"I10",2,4,"I48",,,,,,,,,,,,,,,,,,,,,,,,,,,,,,,,,,,,,,,,,,,,,,5,"I38","I10","I429","I48","R99",,,,,,,,,,,,,,,,8,,,2,4,998,9
1,99,,2,1,"F",1078,,41,21,10,,3,"W",3,2008,"U",,"U","N",,,"G309",189,52,,17,3,1,1,"I469",6,1,"G309",6,2,"E46",,,,,,,,,,,,,,,,,,,,,,,,,,,,,,,,,,,,,,,,,,,,,,,,,,,,3,"G309","E46","I469",,,,,,,,,,,,,,,,,,8,,,2,4,998,9
1,99,,2,1,"F",1082,,42,22,10,,1,"W",2,2008,"U",,"U","N",,,"C859",129,39,,13,4,1,1,"C859",2,1,"N179",6,1,"I10",6,2,"E790",,,,,,,,,,,,,,,,,,,,,,,,,,,,,,,,,,,,,,,,,,,,,,,,,4,"C859","E790","I10","N179",,,,,,,,,,,,,,,,,8,,,2,4,998,9
1,99,,2,1,"M",1048,,35,15,7,,1,"M",2,2008,"U",,"U","N",,,"D432",145,44,,37,4,1,1,"I469",2,1,"I499",3,1,"D432",6,1,"I500",,,,,,,,,,,,,,,,,,,,,,,,,,,,,,,,,,,,,,,,,,,,,,,,,4,"D432","I469","I499","I500",,,,,,,,,,,,,,,,,8,,,2,4,998,9
1,99,,2,1,"F",1047,,35,15,7,,3,"M",5,2008,"U",,"U","N",,,"C97",125,43,,15,2,1,1,"C55",1,2,"C509",,,,,,,,,,,,,,,,,,,,,,,,,,,,,,,,,,,,,,,,,,,,,,,,,,,,,,,3,"C97","C509","C55",,,,,,,,,,,,,,,,,,8,,,2,4,998,9
1,99,,2,1,"M",1066,,39,19,9,,3,"M",2,2008,"U",,"U","N",,,"I10",206,69,,23,1,1,1,"I10",,,,,,,,,,,,,,,,,,,,,,,,,,,,,,,,,,,,,,,,,,,,,,,,,,,,,,,,,,1,"I10",,,,,,,,,,,,,,,,,,,,8,,,2,4,998,9
1,99,,2,1,"M",1041,,34,14,6,,3,"S",7,2008,"U",,"U","N",,,"E668",169,111,,37,4,1,1,"I509",2,1,"E668",6,1,"L031",6,2,"B749",,,,,,,,,,,,,,,,,,,,,,,,,,,,,,,,,,,,,,,,,,,,,,,,,4,"E668","B749","I509","L031",,,,,,,,,,,,,,,,,8,,,2,4,998,9
1,99,,2,1,"M",1054,,36,16,7,,1,"M",5,2008,"U",,"U","N",,,"A279",24,18,,37,3,1,1,"R579",2,1,"J189",3,1,"A279",,,,,,,,,,,,,,,,,,,,,,,,,,,,,,,,,,,,,,,,,,,,,,,,,,,,3,"A279","J189","R579",,,,,,,,,,,,,,,,,,8,,,2,4,998,9
1,99,,2,1,"F",1055,,37,17,8,,9,"D",5,2008,"U",,"U","N",,,"K859",304,111,,37,2,1,1,"R688",2,1,"K859",,,,,,,,,,,,,,,,,,,,,,,,,,,,,,,,,,,,,,,,,,,,,,,,,,,,,,,2,"K859","R688",,,,,,,,,,,,,,,,,,,8,,,2,4,998,9
1,99,,2,1,"M",1078,,41,21,10,,3,"W",7,2008,"U",,"U","N",,,"F29",180,111,,37,3,2,1,"F29",2,2,"R53",6,1,"R54",,,,,,,,,,,,,,,,,,,,,,,,,,,,,,,,,,,,,,,,,,,,,,,,,,,,3,"F29","R53","R54",,,,,,,,,,,,,,,,,,8,,,2,4,998,9
1,99,,2,1,"M",1046,,35,15,7,,3,"M",7,2008,"U",,"U","N",,,"M009",313,111,,37,2,1,1,"A419",2,1,"M009",,,,,,,,,,,,,,,,,,,,,,,,,,,,,,,,,,,,,,,,,,,,,,,,,,,,,,,2,"M009","A419",,,,,,,,,,,,,,,,,,,8,,,2,4,998,9
1,99,,2,1,"M",1062,,38,18,8,,1,"M",3,2008,"U",,"U","N",,,"L031",308,111,,37,3,1,1,"I469",6,1,"L031",6,2,"E119",,,,,,,,,,,,,,,,,,,,,,,,,,,,,,,,,,,,,,,,,,,,,,,,,,,,3,"L031","E119","I469",,,,,,,,,,,,,,,,,,8,,,2,4,998,9
1,99,,2,1,"F",1074,,40,20,9,,3,"M",5,2008,"U",,"U","N",,,"C55",108,31,,10,1,1,1,"C55",,,,,,,,,,,,,,,,,,,,,,,,,,,,,,,,,,,,,,,,,,,,,,,,,,,,,,,,,,1,"C55",,,,,,,,,,,,,,,,,,,,8,,,2,4,998,9
1,99,,2,1,"M",4004,,6,1,1,6,1,"S",3,2008,"U",,"U","N",,,"P059",364,108,87,33,6,1,1,"P285",2,1,"P059",3,1,"P071",6,1,"P90",6,2,"K729",6,3,"D696",,,,,,,,,,,,,,,,,,,,,,,,,,,,,,,,,,,,,,,,,,,5,"P059","D696","K729","P285","P90",,,,,,,,,,,,,,,,8,,,2,4,998,9
1,99,,2,1,"M",1080,,42,22,10,,1,"W",3,2008,"U",,"U","N",,,"J440",267,86,,28,6,1,1,"J181",2,1,"J449",6,1,"N179",6,2,"E119",6,3,"I10",6,4,"I500",,,,,,,,,,,,,,,,,,,,,,,,,,,,,,,,,,,,,,,,,,,5,"J440","E119","I10","I500","N179",,,,,,,,,,,,,,,,8,,,2,4,998,9
1,99,,2,1,"F",1057,,37,17,8,,1,"W",1,2008,"U",,"U","N",,,"J189",257,78,,27,5,1,1,"I469",2,1,"A419",3,1,"J189",6,1,"I429",6,2,"J969",,,,,,,,,,,,,,,,,,,,,,,,,,,,,,,,,,,,,,,,,,,,,,5,"J189","A419","I429","I469","J969",,,,,,,,,,,,,,,,8,,,2,4,998,9
1,99,,2,1,"M",1047,,35,15,7,,1,"M",7,2008,"U",,"U","N",,,"A419",23,10,,37,4,1,1,"J969",2,1,"J80",3,1,"A419",6,1,"K254",,,,,,,,,,,,,,,,,,,,,,,,,,,,,,,,,,,,,,,,,,,,,,,,,4,"A419","J80","J969","K254",,,,,,,,,,,,,,,,,8,,,2,4,998,9
1,99,,2,2,"M",1094,,44,24,11,,3,"W",5,2008,"U",,"U","N",,,"I119",207,56,,20,2,1,1,"I516",2,1,"I10",,,,,,,,,,,,,,,,,,,,,,,,,,,,,,,,,,,,,,,,,,,,,,,,,,,,,,,3,"I119","I10","I516",,,,,,,,,,,,,,,,,,8,,,2,4,998,9
4,99,,2,2,"M",1039,,33,13,6,,7,"M",2,2008,"Y",,"U","N",9,9,"X47",422,122,,39,3,1,1,"R99",6,1,"T598",6,2,"X47",,,,,,,,,,,,,,,,,,,,,,,,,,,,,,,,,,,,,,,,,,,,,,,,,,,,3,"X47","R99","T598",,,,,,,,,,,,,,,,,,4,,,2,4,998,9
1,99,,2,2,"M",1047,,35,15,7,,3,"M",1,2008,"U",,"U","N",,,"C762",125,43,,15,1,1,1,"C762",,,,,,,,,,,,,,,,,,,,,,,,,,,,,,,,,,,,,,,,,,,,,,,,,,,,,,,,,,1,"C762",,,,,,,,,,,,,,,,,,,,8,,,2,4,998,9
1,99,,2,2,"M",1070,,40,20,9,,1,"M",7,2008,"U",,"U","N",,,"C61",113,33,,11,6,2,1,"I500",3,1,"N179",3,2,"E875",6,1,"R068",6,2,"C61",6,3,"I48",,,,,,,,,,,,,,,,,,,,,,,,,,,,,,,,,,,,,,,,,,,6,"C61","E875","I48","I500","N179","R068",,,,,,,,,,,,,,,8,,,2,4,998,9
1,99,,2,2,"F",1069,,39,19,9,,2,"M",5,2008,"U",,"U","N",,,"I219",211,59,,21,3,1,1,"I219",2,1,"I250",3,1,"J459",,,,,,,,,,,,,,,,,,,,,,,,,,,,,,,,,,,,,,,,,,,,,,,,,,,,3,"I219","I250","J459",,,,,,,,,,,,,,,,,,8,,,2,4,998,9
1,99,,2,2,"M",1076,,41,21,10,,1,"M",4,2008,"U",,"U","N",,,"N19",327,100,,31,2,1,1,"I499",2,1,"N19",,,,,,,,,,,,,,,,,,,,,,,,,,,,,,,,,,,,,,,,,,,,,,,,,,,,,,,2,"N19","I499",,,,,,,,,,,,,,,,,,,8,,,2,4,998,9
1,99,,2,2,"F",1009,,27,7,3,,1,"S",2,2008,"U",,"U","N",,,"M359",313,111,,37,3,1,1,"N19",2,1,"N059",3,1,"M359",,,,,,,,,,,,,,,,,,,,,,,,,,,,,,,,,,,,,,,,,,,,,,,,,,,,3,"M359","N059","N19",,,,,,,,,,,,,,,,,,8,,,2,4,998,9
1,99,,2,2,"F",1049,,35,15,7,,3,"S",2,2008,"U",,"U","N",,,"E669",169,111,,37,2,1,1,"I500",2,1,"E669",,,,,,,,,,,,,,,,,,,,,,,,,,,,,,,,,,,,,,,,,,,,,,,,,,,,,,,2,"E669","I500",,,,,,,,,,,,,,,,,,,8,,,2,4,998,9
1,99,,2,2,"M",2002,,13,2,1,13,3,"S",1,2008,"U",,"U","N",,,"E86",172,111,37,37,3,1,1,"J189",2,1,"E86",6,1,"R95",,,,,,,,,,,,,,,,,,,,,,,,,,,,,,,,,,,,,,,,,,,,,,,,,,,,3,"E86","J189","R95",,,,,,,,,,,,,,,,,,8,,,2,4,998,9
1,99,,2,2,"M",1044,,34,14,6,,1,"S",7,2008,"U",,"U","N",9,9,"X44",420,122,,39,6,1,1,"A419",2,1,"D619",3,1,"T504",3,2,"X44",6,1,"J189",6,2,"N179",,,,,,,,,,,,,,,,,,,,,,,,,,,,,,,,,,,,,,,,,,,6,"X44","A419","D619","J189","N179","T504",,,,,,,,,,,,,,,8,,,2,4,998,9
1,99,,2,2,"M",1078,,41,21,10,,3,"M",5,2008,"U",,"U","N",,,"N180",327,100,,31,7,1,1,"N180",6,1,"I429",6,2,"E780",6,3,"M109",6,4,"K277",6,5,"M199",6,6,"H669",,,,,,,,,,,,,,,,,,,,,,,,,,,,,,,,,,,,,,,,7,"N180","E780","H669","I429","K277","M109","M199",,,,,,,,,,,,,,8,,,2,4,998,9
1,99,,2,2,"F",1017,,29,9,4,,1,"S",5,2008,"U",,"U","N",,,"C499",103,43,,15,5,1,1,"C499",1,2,"C80",6,1,"D649",6,2,"E875",6,3,"N19",,,,,,,,,,,,,,,,,,,,,,,,,,,,,,,,,,,,,,,,,,,,,,4,"C499","D649","E875","N19",,,,,,,,,,,,,,,,,8,,,2,4,998,9
1,99,,2,2,"M",1079,,41,21,10,,2,"M",4,2008,"U",,"U","N",,,"I251",215,63,,21,13,1,1,"J181",2,1,"T827",2,2,"N179",2,3,"E872",3,1,"J960",6,1,"J449",6,2,"J439",6,3,"I259",6,4,"Y832",6,5,"I251",6,6,"B909",6,7,"E790",6,8,"C61",,,,,,,,,,,,,,,,,,,,,,11,"I251","B909","C61","E790","E872","J439","J440","J960","N179","T827","Y832",,,,,,,,,,8,,,2,4,998,9
1,99,,2,2,"F",1034,,32,12,5,,3,"M",2,2008,"U",,"U","U",,,"I609",235,70,,24,2,1,1,"I611",2,1,"I671",,,,,,,,,,,,,,,,,,,,,,,,,,,,,,,,,,,,,,,,,,,,,,,,,,,,,,,1,"I609",,,,,,,,,,,,,,,,,,,,8,,,2,4,998,9
1,99,,2,2,"M",1057,,37,17,8,,1,"M",7,2008,"U",,"U","N",,,"J440",267,86,,28,10,1,1,"A419",1,2,"J960",2,1,"J189",2,2,"A415",3,1,"J449",6,1,"N289",6,2,"K552",6,3,"I429",6,4,"I48",6,5,"I10",,,,,,,,,,,,,,,,,,,,,,,,,,,,,,,8,"J440","A415","I10","I429","I48","J960","K552","N289",,,,,,,,,,,,,8,,,2,4,998,9
1,99,,2,2,"M",1056,,37,17,8,,3,"S",6,2008,"U",,"U","N",,9,"I10",206,69,,23,4,1,1,"R001",2,1,"I10",6,1,"T519",6,2,"X45",,,,,,,,,,,,,,,,,,,,,,,,,,,,,,,,,,,,,,,,,,,,,,,,,4,"I10","R001","T519","X45",,,,,,,,,,,,,,,,,8,,,2,4,998,9
1,99,,2,2,"F",1021,,30,10,4,,1,"M",3,2008,"U",,"U","N",,,"O882",350,107,,32,5,1,1,"O882",2,1,"O908",3,1,"O85",6,1,"O85",6,2,"O997",,,,,,,,,,,,,,,,,,,,,,,,,,,,,,,,,,,,,,,,,,,,,,3,"O882","O85","O908",,,,,,,,,,,,,,,,,,8,,,2,4,998,9
1,99,,2,2,"M",1032,,32,12,5,,3,"S",5,2008,"U",,"U","Y",,,"I219",211,59,,21,3,1,1,"I219",2,1,"I251",3,1,"I219",,,,,,,,,,,,,,,,,,,,,,,,,,,,,,,,,,,,,,,,,,,,,,,,,,,,3,"I219","I219","I251",,,,,,,,,,,,,,,,,,8,,,2,4,998,9
1,99,,2,2,"M",1043,,34,14,6,,3,"S",2,2008,"U",,"U","N",,9,"G473",194,111,,37,4,1,1,"J969",2,1,"T179",2,2,"W80",3,1,"G473",,,,,,,,,,,,,,,,,,,,,,,,,,,,,,,,,,,,,,,,,,,,,,,,,4,"G473","J969","T179","W80",,,,,,,,,,,,,,,,,8,,,2,4,998,9
1,99,,2,2,"F",1065,,39,19,9,,1,"W",6,2008,"U",,"U","N",,,"E149",159,46,,16,3,1,1,"I64",2,1,"I10",3,1,"E149",,,,,,,,,,,,,,,,,,,,,,,,,,,,,,,,,,,,,,,,,,,,,,,,,,,,3,"E149","I10","I64",,,,,,,,,,,,,,,,,,8,,,2,4,998,9
1,99,,2,2,"M",1055,,37,17,8,,1,"M",5,2008,"U",,"U","U",,,"D696",153,111,,37,12,1,1,"J189",2,1,"K922",3,1,"R99",4,1,"D696",6,1,"I500",6,2,"E119",6,3,"I10",6,4,"E785",6,5,"M109",6,6,"B354",6,7,"N390",6,8,"D728",,,,,,,,,,,,,,,,,,,,,,,,,12,"D696","B354","D728","E119","E785","I10","I500","J189","K922","M109","N390","R99",,,,,,,,,8,,,2,4,998,9
1,99,,2,2,"F",1049,,35,15,7,,1,"M",2,2008,"U",,"U","N",,,"I619",236,70,,24,2,1,1,"I619",2,1,"I10",,,,,,,,,,,,,,,,,,,,,,,,,,,,,,,,,,,,,,,,,,,,,,,,,,,,,,,2,"I619","I10",,,,,,,,,,,,,,,,,,,8,,,2,4,998,9
1,99,,2,2,"M",1045,,35,15,7,,1,"M",6,2008,"U",,"U","N",,,"I120",208,69,,23,8,1,1,"I712",2,1,"I711",3,1,"I10",6,1,"N180",6,2,"J189",6,3,"J90",6,4,"E669",6,5,"E790",,,,,,,,,,,,,,,,,,,,,,,,,,,,,,,,,,,,,7,"I120","E669","E790","I711","I712","J189","J90",,,,,,,,,,,,,,8,,,2,4,998,9
1,99,,2,2,"F",1067,,39,19,9,,1,"S",5,2008,"U",,"U","N",,,"E46",167,48,,37,9,1,1,"A410",2,1,"E46",3,1,"R630",4,1,"R99",6,1,"N189",6,2,"N200",6,3,"T814",6,4,"Y836",6,5,"K639",,,,,,,,,,,,,,,,,,,,,,,,,,,,,,,,,,9,"E46","A410","K639","N189","N200","R630","R99","T814","Y836",,,,,,,,,,,,8,,,2,4,998,9
1,99,,2,2,"M",1074,,40,20,9,,3,"M",7,2008,"U",,"U","N",,,"C349",93,27,,8,2,1,1,"C349",2,1,"J449",,,,,,,,,,,,,,,,,,,,,,,,,,,,,,,,,,,,,,,,,,,,,,,,,,,,,,,2,"C349","J449",,,,,,,,,,,,,,,,,,,8,,,2,4,998,9
1,99,,2,3,"M",1057,,37,17,8,,1,"M",7,2008,"U",,"U","N",,,"I619",236,70,,24,3,1,1,"I619",2,1,"L89",3,1,"I10",,,,,,,,,,,,,,,,,,,,,,,,,,,,,,,,,,,,,,,,,,,,,,,,,,,,3,"I619","I10","L89",,,,,,,,,,,,,,,,,,8,,,2,4,998,9
1,99,,2,3,"F",1061,,38,18,8,,1,"M",4,2008,"U",,"U","N",,,"I619",236,70,,24,4,1,1,"R092",2,1,"L039",3,1,"L89",6,1,"I619",,,,,,,,,,,,,,,,,,,,,,,,,,,,,,,,,,,,,,,,,,,,,,,,,4,"I619","L039","L89","R092",,,,,,,,,,,,,,,,,8,,,2,4,998,9
1,99,,2,3,"M",1041,,34,14,6,,2,"M",3,2008,"U",,"U","N",,,"E669",169,111,,37,4,1,1,"I219",2,1,"E669",3,1,"I509",6,1,"I516",,,,,,,,,,,,,,,,,,,,,,,,,,,,,,,,,,,,,,,,,,,,,,,,,4,"E669","I219","I509","I516",,,,,,,,,,,,,,,,,8,,,2,4,998,9
1,99,,2,3,"M",1057,,37,17,8,,1,"M",3,2008,"U",,"U","N",,,"I619",236,70,,24,4,1,1,"I64",1,2,"I619",1,3,"G936",2,1,"I10",,,,,,,,,,,,,,,,,,,,,,,,,,,,,,,,,,,,,,,,,,,,,,,,,3,"I619","G936","I10",,,,,,,,,,,,,,,,,,8,,,2,4,998,9
1,99,,2,3,"M",1044,,34,14,6,,2,"W",4,2008,"U",,"U","N",,,"I219",211,59,,21,2,1,1,"I219",6,1,"I10",,,,,,,,,,,,,,,,,,,,,,,,,,,,,,,,,,,,,,,,,,,,,,,,,,,,,,,2,"I219","I10",,,,,,,,,,,,,,,,,,,8,,,2,4,998,9
1,99,,2,3,"M",1083,,42,22,10,,1,"M",3,2008,"U",,"U","N",,,"D430",145,44,,37,1,1,1,"D430",,,,,,,,,,,,,,,,,,,,,,,,,,,,,,,,,,,,,,,,,,,,,,,,,,,,,,,,,,1,"D430",,,,,,,,,,,,,,,,,,,,8,,,2,4,998,9
1,99,,2,3,"M",1065,,39,19,9,,1,"M",1,2008,"U",,"U","N",,,"K319",289,111,,37,11,1,1,"A419",2,1,"J189",2,2,"L089",2,3,"A419",3,1,"Y838",3,2,"K918",6,1,"Y833",6,2,"K319",6,3,"K746",6,4,"E119",6,5,"I10",,,,,,,,,,,,,,,,,,,,,,,,,,,,10,"K319","A419","E119","I10","J189","K746","K918","L089","Y833","Y838",,,,,,,,,,,8,,,2,4,998,9
1,99,,2,3,"F",1057,,37,17,8,,1,"M",7,2008,"U",,"U","N",,,"K729",301,111,,37,4,1,1,"D65",2,1,"A419",3,1,"K729",6,1,"E119",,,,,,,,,,,,,,,,,,,,,,,,,,,,,,,,,,,,,,,,,,,,,,,,,4,"K729","A419","D65","E119",,,,,,,,,,,,,,,,,8,,,2,4,998,9
1,99,,2,3,"M",1069,,39,19,9,,1,"M",7,2008,"U",,"U","N",,,"N19",327,100,,31,6,1,1,"I219",2,1,"J181",2,2,"J189",3,1,"N19",6,1,"N19",6,2,"K768",,,,,,,,,,,,,,,,,,,,,,,,,,,,,,,,,,,,,,,,,,,5,"N19","I219","J181","J189","K768",,,,,,,,,,,,,,,,8,,,2,4,998,9
1,99,,2,3,"F",1089,,43,23,11,,3,"M",7,2008,"U",,"U","N",,,"R99",379,110,,36,1,1,1,"R99",,,,,,,,,,,,,,,,,,,,,,,,,,,,,,,,,,,,,,,,,,,,,,,,,,,,,,,,,,1,"R99",,,,,,,,,,,,,,,,,,,,8,,,2,4,998,9
1,99,,2,3,"M",1071,,40,20,9,,1,"M",1,2008,"U",,"U","N",,,"C229",85,24,,15,6,1,1,"C229",6,1,"I10",6,2,"J449",6,3,"J47",6,4,"F171",6,5,"E790",,,,,,,,,,,,,,,,,,,,,,,,,,,,,,,,,,,,,,,,,,,6,"C229","E790","F171","I10","J449","J47",,,,,,,,,,,,,,,8,,,2,4,998,9
1,99,,2,3,"F",1052,,36,16,7,,2,"W",4,2008,"U",,"U","N",,,"E149",159,46,,16,5,1,1,"A419",2,1,"J189",3,1,"E149",6,1,"I10",6,2,"I64",,,,,,,,,,,,,,,,,,,,,,,,,,,,,,,,,,,,,,,,,,,,,,5,"E149","A419","I10","I64","J189",,,,,,,,,,,,,,,,8,,,2,4,998,9
1,99,,2,3,"M",1065,,39,19,9,,1,"M",2,2008,"U",,"U","N",,,"I420",227,68,,22,5,1,1,"I420",2,1,"I509",3,1,"I48",6,1,"I313",6,2,"R18",,,,,,,,,,,,,,,,,,,,,,,,,,,,,,,,,,,,,,,,,,,,,,5,"I420","I313","I48","I509","R18",,,,,,,,,,,,,,,,8,,,2,4,998,9
1,99,,2,3,"M",1060,,38,18,8,,3,"M",7,2008,"U",,"U","N",,,"I219",211,59,,21,1,1,1,"I219",,,,,,,,,,,,,,,,,,,,,,,,,,,,,,,,,,,,,,,,,,,,,,,,,,,,,,,,,,1,"I219",,,,,,,,,,,,,,,,,,,,8,,,2,4,998,9
1,99,,2,3,"F",1073,,40,20,9,,3,"M",4,2008,"U",,"U","N",,,"I639",237,70,,24,5,1,1,"I639",6,1,"I10",6,2,"E119",6,3,"R252",6,4,"I839",,,,,,,,,,,,,,,,,,,,,,,,,,,,,,,,,,,,,,,,,,,,,,5,"I639","E119","I10","I839","R252",,,,,,,,,,,,,,,,8,,,2,4,998,9
1,99,,2,3,"F",1063,,38,18,8,,1,"M",4,2008,"U",,"U","N",,,"C509",104,29,,9,4,1,1,"C509",1,2,"C787",2,1,"N19",3,1,"E149",,,,,,,,,,,,,,,,,,,,,,,,,,,,,,,,,,,,,,,,,,,,,,,,,4,"C509","C787","E149","N19",,,,,,,,,,,,,,,,,8,,,2,4,998,9
1,99,,2,3,"M",1064,,38,18,8,,3,"M",3,2008,"U",,"U","N",,,"M109",313,111,,37,4,1,1,"I500",1,2,"I10",2,1,"I429",3,1,"M109",,,,,,,,,,,,,,,,,,,,,,,,,,,,,,,,,,,,,,,,,,,,,,,,,4,"M109","I10","I429","I500",,,,,,,,,,,,,,,,,8,,,2,4,998,9
1,99,,2,3,"F",1008,,27,7,3,,1,"S",7,2008,"U",,"U","N",,,"G039",186,50,,37,5,1,1,"G039",1,2,"G049",2,1,"R99",6,1,"J90",6,2,"N179",,,,,,,,,,,,,,,,,,,,,,,,,,,,,,,,,,,,,,,,,,,,,,5,"G039","G049","J90","N179","R99",,,,,,,,,,,,,,,,8,,,2,4,998,9
1,99,,2,3,"F",1043,,34,14,6,,3,"S",4,2008,"U",,"U","N",,,"E149",159,46,,16,3,1,1,"N180",2,1,"E149",3,1,"I10",,,,,,,,,,,,,,,,,,,,,,,,,,,,,,,,,,,,,,,,,,,,,,,,,,,,2,"E149","I120",,,,,,,,,,,,,,,,,,,8,,,2,4,998,9
1,99,,2,3,"F",1076,,41,21,10,,1,"W",3,2008,"U",,"U","N",,,"E149",159,46,,16,5,1,1,"I64",2,1,"I10",3,1,"E149",6,1,"I219",6,2,"I48",,,,,,,,,,,,,,,,,,,,,,,,,,,,,,,,,,,,,,,,,,,,,,5,"E149","I10","I219","I48","I64",,,,,,,,,,,,,,,,8,,,2,4,998,9
1,99,,2,3,"F",1065,,39,19,9,,2,"M",1,2008,"U",,"U","N",,,"E115",159,46,,16,6,1,1,"E145",1,2,"A419",2,1,"E119",3,1,"I10",6,1,"I694",6,2,"R53",,,,,,,,,,,,,,,,,,,,,,,,,,,,,,,,,,,,,,,,,,,5,"E115","A419","I10","I694","R53",,,,,,,,,,,,,,,,8,,,2,4,998,9
1,99,,2,3,"M",1061,,38,18,8,,3,"M",3,2008,"U",,"U","N",,,"E149",159,46,,16,6,1,1,"I219",2,1,"T817",2,2,"E149",3,1,"Y833",3,2,"K639",3,3,"L89",,,,,,,,,,,,,,,,,,,,,,,,,,,,,,,,,,,,,,,,,,,6,"E149","I219","K639","L89","T817","Y833",,,,,,,,,,,,,,,8,,,2,4,998,9
1,99,,2,4,"F",1058,,37,17,8,,2,"M",4,2008,"U",,"U","N",,,"E149",159,46,,16,4,1,1,"A419",2,1,"E149",3,1,"I10",6,1,"E669",,,,,,,,,,,,,,,,,,,,,,,,,,,,,,,,,,,,,,,,,,,,,,,,,4,"E149","A419","E669","I10",,,,,,,,,,,,,,,,,8,,,2,4,998,9
1,99,,2,4,"F",1091,,44,24,11,,1,"W",3,2008,"U",,"U","N",,,"I48",228,68,,22,2,1,1,"J690",2,1,"I48",,,,,,,,,,,,,,,,,,,,,,,,,,,,,,,,,,,,,,,,,,,,,,,,,,,,,,,2,"I48","J690",,,,,,,,,,,,,,,,,,,8,,,2,4,998,9
1,99,,2,4,"F",4004,,6,1,1,6,1,"S",3,2008,"U",,"U","N",,,"P251",362,108,100,33,4,1,1,"P239",2,1,"P240",3,1,"P251",6,1,"Q870",,,,,,,,,,,,,,,,,,,,,,,,,,,,,,,,,,,,,,,,,,,,,,,,,4,"P251","P239","P240","Q870",,,,,,,,,,,,,,,,,8,,,2,4,998,9
1,99,,2,4,"F",4024,,11,1,1,11,3,"S",2,2008,"U",,"U","N",,,"R95",378,110,135,35,1,1,1,"R95",,,,,,,,,,,,,,,,,,,,,,,,,,,,,,,,,,,,,,,,,,,,,,,,,,,,,,,,,,1,"R95",,,,,,,,,,,,,,,,,,,,8,,,2,4,998,9
1,99,,2,4,"F",1078,,41,21,10,,2,"W",1,2008,"U",,"U","N",9,9,"W78",410,123,,39,6,1,1,"I219",2,1,"T179",2,2,"W78",6,1,"I500",6,2,"E109",6,3,"I10",,,,,,,,,,,,,,,,,,,,,,,,,,,,,,,,,,,,,,,,,,,6,"W78","E109","I10","I219","I500","T179",,,,,,,,,,,,,,,8,,,2,4,998,9
1,99,,2,4,"M",1078,,41,21,10,,2,"W",6,2008,"U",,"U","N",,,"N179",327,100,,31,11,1,1,"J189",1,2,"R601",1,3,"E86",2,1,"N179",6,1,"E119",6,2,"I10",6,3,"M628",6,4,"M109",6,5,"E790",6,6,"K768",6,7,"J449",,,,,,,,,,,,,,,,,,,,,,,,,,,,10,"N179","E119","E790","E86","I10","J440","K768","M109","M628","R601",,,,,,,,,,,8,,,2,4,998,9
1,99,,2,4,"M",1038,,33,13,6,,3,"M",5,2008,"U",,"U","N",,,"C329",92,26,,15,1,1,1,"C329",,,,,,,,,,,,,,,,,,,,,,,,,,,,,,,,,,,,,,,,,,,,,,,,,,,,,,,,,,1,"C329",,,,,,,,,,,,,,,,,,,,8,,,2,4,998,9
1,99,,2,4,"F",1086,,43,23,11,,3,"W",4,2008,"U",,"U","N",,,"E119",159,46,,16,3,1,1,"I219",2,1,"E119",3,1,"I10",,,,,,,,,,,,,,,,,,,,,,,,,,,,,,,,,,,,,,,,,,,,,,,,,,,,3,"E119","I10","I219",,,,,,,,,,,,,,,,,,8,,,2,4,998,9
1,99,,2,4,"F",1047,,35,15,7,,1,"M",2,2008,"U",,"U","N",,,"I619",236,70,,24,8,1,1,"I10",2,1,"I609",2,2,"K509",2,3,"K922",3,1,"I619",6,1,"E119",6,2,"R945",6,3,"E835",,,,,,,,,,,,,,,,,,,,,,,,,,,,,,,,,,,,,8,"I619","E119","E835","I10","I609","K509","K922","R945",,,,,,,,,,,,,8,,,2,4,998,9
1,99,,2,4,"F",1073,,40,20,9,,2,"W",5,2008,"U",,"U","N",,,"C55",108,31,,10,2,1,1,"C55",1,2,"C80",,,,,,,,,,,,,,,,,,,,,,,,,,,,,,,,,,,,,,,,,,,,,,,,,,,,,,,1,"C55",,,,,,,,,,,,,,,,,,,,8,,,2,4,998,9
1,99,,2,4,"M",1047,,35,15,7,,2,"M",6,2008,"U",,"U","N",,,"E119",159,46,,16,4,1,1,"I251",2,1,"I500",2,2,"E119",3,1,"G473",,,,,,,,,,,,,,,,,,,,,,,,,,,,,,,,,,,,,,,,,,,,,,,,,4,"E119","G473","I251","I500",,,,,,,,,,,,,,,,,8,,,2,4,998,9
1,99,,2,4,"F",1061,,38,18,8,,1,"W",5,2008,"U",,"U","N",,,"N180",327,100,,31,7,1,1,"A419",2,1,"T827",2,2,"Y832",6,1,"N180",6,2,"E46",6,3,"E149",6,4,"D696",,,,,,,,,,,,,,,,,,,,,,,,,,,,,,,,,,,,,,,,7,"N180","A419","D696","E149","E46","T827","Y832",,,,,,,,,,,,,,8,,,2,4,998,9
1,99,,2,4,"M",1061,,38,18,8,,1,"D",5,2008,"U",,"U","N",,,"Y833",456,135,,39,7,1,1,"A419",2,1,"L89",2,2,"T814",2,3,"Y833",2,4,"K639",6,1,"I500",6,2,"I48",,,,,,,,,,,,,,,,,,,,,,,,,,,,,,,,,,,,,,,,7,"Y833","A419","I48","I500","K639","L89","T814",,,,,,,,,,,,,,1,,,1,1,998,9
1,99,,2,4,"M",1042,,34,14,6,,1,"M",3,2008,"U",,"U","N",,,"I619",236,70,,24,3,1,1,"I619",2,1,"I10",6,1,"E149",,,,,,,,,,,,,,,,,,,,,,,,,,,,,,,,,,,,,,,,,,,,,,,,,,,,3,"I619","E149","I10",,,,,,,,,,,,,,,,,,8,,,2,4,998,9
1,99,,2,4,"M",1085,,43,23,11,,1,"W",2,2008,"U",,"U","N",,,"I694",239,70,,24,9,1,1,"I611",1,2,"I614",2,1,"I694",3,1,"I10",6,1,"R402",6,2,"I48",6,3,"E871",6,4,"M109",6,5,"M199",,,,,,,,,,,,,,,,,,,,,,,,,,,,,,,,,,9,"I694","E871","I10","I48","I611","I614","M109","M199","R402",,,,,,,,,,,,8,,,2,4,998,9
1,99,,2,4,"F",1084,,42,22,10,,3,"M",1,2008,"U",,"U","N",,9,"J690",273,88,,37,4,1,1,"J690",2,1,"W80",6,1,"E86",6,2,"E46",,,,,,,,,,,,,,,,,,,,,,,,,,,,,,,,,,,,,,,,,,,,,,,,,4,"J690","E46","E86","W80",,,,,,,,,,,,,,,,,8,,,2,4,998,9
1,99,,2,4,"M",1067,,39,19,9,,3,"M",1,2008,"U",,"U","N",,,"I110",207,56,,20,3,1,1,"I500",2,1,"I10",6,1,"E119",,,,,,,,,,,,,,,,,,,,,,,,,,,,,,,,,,,,,,,,,,,,,,,,,,,,4,"I110","E119","I10","I500",,,,,,,,,,,,,,,,,8,,,2,4,998,9
1,99,,2,4,"M",1088,,43,23,11,,1,"M",7,2008,"U",,"U","N",,,"J440",267,86,,28,4,1,1,"J960",2,1,"J189",2,2,"J449",6,1,"C80",,,,,,,,,,,,,,,,,,,,,,,,,,,,,,,,,,,,,,,,,,,,,,,,,3,"J440","C80","J960",,,,,,,,,,,,,,,,,,8,,,2,4,998,9
1,99,,2,4,"M",1068,,39,19,9,,1,"M",4,2008,"U",,"U","N",,,"C444",99,43,,15,8,1,1,"C444",2,1,"F179",6,1,"E119",6,2,"I10",6,3,"J690",6,4,"I693",6,5,"M109",6,6,"E871",,,,,,,,,,,,,,,,,,,,,,,,,,,,,,,,,,,,,8,"C444","E119","E871","F179","I10","I693","J690","M109",,,,,,,,,,,,,8,,,2,4,998,9
1,99,,2,4,"M",1070,,40,20,9,,3,"M",3,2008,"U",,"U","N",,,"C61",113,33,,11,3,1,1,"C61",6,1,"E119",6,2,"I10",,,,,,,,,,,,,,,,,,,,,,,,,,,,,,,,,,,,,,,,,,,,,,,,,,,,3,"C61","E119","I10",,,,,,,,,,,,,,,,,,8,,,2,4,998,9
1,99,,2,5,"F",1076,,41,21,10,,1,"W",6,2008,"U",,"U","N",,,"N179",327,100,,31,5,1,1,"N179",2,1,"E872",3,1,"N19",3,2,"K566",6,1,"D487",,,,,,,,,,,,,,,,,,,,,,,,,,,,,,,,,,,,,,,,,,,,,,4,"N179","D487","E872","K566",,,,,,,,,,,,,,,,,8,,,2,4,998,9
1,99,,2,5,"M",1067,,39,19,9,,3,"M",3,2008,"U",,"U","N",,,"I219",211,59,,21,1,1,1,"I219",,,,,,,,,,,,,,,,,,,,,,,,,,,,,,,,,,,,,,,,,,,,,,,,,,,,,,,,,,1,"I219",,,,,,,,,,,,,,,,,,,,8,,,2,4,998,9
1,99,,2,5,"M",1062,,38,18,8,,3,"S",1,2008,"U",,"U","Y",,,"I634",237,70,,24,3,1,1,"I639",2,1,"I634",3,1,"I250",,,,,,,,,,,,,,,,,,,,,,,,,,,,,,,,,,,,,,,,,,,,,,,,,,,,2,"I634","I250",,,,,,,,,,,,,,,,,,,1,,,1,1,998,9
1,99,,2,5,"F",1027,,31,11,5,,3,"M",1,2008,"U",,"U","N",,,"O998",355,107,,32,3,1,1,"O994",2,1,"O990",6,1,"O992",,,,,,,,,,,,,,,,,,,,,,,,,,,,,,,,,,,,,,,,,,,,,,,,,,,,2,"O998","O992",,,,,,,,,,,,,,,,,,,8,,,2,4,998,9
1,99,,2,5,"F",1062,,38,18,8,,3,"M",7,2008,"U",,"U","N",,,"C349",93,27,,8,2,1,1,"C349",6,1,"I10",,,,,,,,,,,,,,,,,,,,,,,,,,,,,,,,,,,,,,,,,,,,,,,,,,,,,,,2,"C349","I10",,,,,,,,,,,,,,,,,,,8,,,2,4,998,9
1,99,,2,5,"M",1065,,39,19,9,,1,"M",4,2008,"N",,"U","N",,,"I119",207,56,,20,3,1,1,"I516",2,1,"I10",6,1,"E149",,,,,,,,,,,,,,,,,,,,,,,,,,,,,,,,,,,,,,,,,,,,,,,,,,,,4,"I119","E149","I10","I516",,,,,,,,,,,,,,,,,8,,,2,4,998,9
1,99,,2,5,"M",1063,,38,18,8,,3,"M",1,2008,"U",,"U","N",,,"I219",211,59,,21,1,1,1,"I219",,,,,,,,,,,,,,,,,,,,,,,,,,,,,,,,,,,,,,,,,,,,,,,,,,,,,,,,,,1,"I219",,,,,,,,,,,,,,,,,,,,8,,,2,4,998,9
1,99,,2,5,"M",1075,,41,21,10,,9,"M",7,2008,"U",,"U","N",,,"I619",236,70,,24,2,1,1,"I619",2,1,"I10",,,,,,,,,,,,,,,,,,,,,,,,,,,,,,,,,,,,,,,,,,,,,,,,,,,,,,,2,"I619","I10",,,,,,,,,,,,,,,,,,,8,,,2,4,998,9
1,99,,2,5,"M",1059,,37,17,8,,1,"M",6,2008,"U",,"U","N",,,"C859",129,39,,13,5,1,1,"N180",2,1,"N139",3,1,"C859",6,1,"I509",6,2,"I48",,,,,,,,,,,,,,,,,,,,,,,,,,,,,,,,,,,,,,,,,,,,,,5,"C859","I48","I509","N139","N180",,,,,,,,,,,,,,,,8,,,2,4,998,9