"restatus","educ89","educ","educflag","monthdth","sex","age","ageflag","ager52","ager27","ager12","ager22","placdth","marstat","weekday","year","injwork","mandeath","methdisp","autopsy","activity","injury","ucod","ucr358","ucr113","ucr130","ucr39","eanum","econdp_1","econds_1","enicon_1","econdp_2","econds_2","enicon_2","econdp_3","econds_3","enicon_3","econdp_4","econds_4","enicon_4","econdp_5","econds_5","enicon_5","econdp_6","econds_6","enicon_6","econdp_7","econds_7","enicon_7","econdp_8","econds_8","enicon_8","econdp_9","econds_9","enicon_9","econdp_10","econds_10","enicon_10","econdp_11","econds_11","enicon_11","econdp_12","econds_12","enicon_12","econdp_13","econds_13","enicon_13","econdp_14","econds_14","enicon_14","econdp_15","econds_15","enicon_15","econdp_16","econds_16","enicon_16","econdp_17","econds_17","enicon_17","econdp_18","econds_18","enicon_18","econdp_19","econds_19","enicon_19","econdp_20","econds_20","enicon_20","ranum","record_1","record_2","record_3","record_4","record_5","record_6","record_7","record_8","record_9","record_10","record_11","record_12","record_13","record_14","record_15","record_16","record_17","record_18","record_19","record_20","race","brace","raceimp","racer3","racer5","hispanic","hspanicr"
1,99,,0,1,"M",1045,,35,15,7,,3,"M",2,2005,"U",,"U","U",,,"R568",380,110,,36,1,1,1,"R568",,,,,,,,,,,,,,,,,,,,,,,,,,,,,,,,,,,,,,,,,,,,,,,,,,,,,,,,,,1,"R568",,,,,,,,,,,,,,,,,,,,8,,,2,4,998,9
1,99,,0,1,"M",1077,,41,21,10,,1,"M",2,2005,"U",,"U","N",,,"J449",267,86,,28,6,1,1,"E872",2,1,"A419",3,1,"J189",3,2,"J449",6,1,"I48",6,2,"N19",,,,,,,,,,,,,,,,,,,,,,,,,,,,,,,,,,,,,,,,,,,6,"A419","E872","I48","J189","J449","N19",,,,,,,,,,,,,,,8,,,2,4,998,9
1,99,,0,1,"M",1070,,40,20,9,,1,"M",3,2005,"U",,"U","N",,,"L031",308,111,,37,5,1,1,"A419",2,1,"E872",3,1,"L031",6,1,"I499",6,2,"E162",,,,,,,,,,,,,,,,,,,,,,,,,,,,,,,,,,,,,,,,,,,,,,5,"A419","E162","E872","I499","L031",,,,,,,,,,,,,,,,8,,,2,4,998,9
1,99,,0,1,"M",1085,,43,23,11,,1,"M",3,2005,"U",,"U","N",,,"D70",154,111,,37,5,1,1,"J969",2,1,"J189",6,1,"E149",6,2,"N19",6,3,"D70",,,,,,,,,,,,,,,,,,,,,,,,,,,,,,,,,,,,,,,,,,,,,,5,"D70","E149","J189","J969","N19",,,,,,,,,,,,,,,,8,,,2,4,998,9
1,99,,0,1,"M",1062,,38,18,8,,1,"M",3,2005,"U",,"U","N",,,"I64",238,70,,24,3,1,1,"I469",2,1,"I64",3,1,"I10",,,,,,,,,,,,,,,,,,,,,,,,,,,,,,,,,,,,,,,,,,,,,,,,,,,,3,"I10","I469","I64",,,,,,,,,,,,,,,,,,8,,,2,4,998,9
1,99,,0,1,"M",1060,,38,18,8,,1,"M",5,2005,"U",,"U","N",,,"I429",227,68,,22,9,1,1,"I499",2,1,"I48",3,1,"I429",3,2,"I259",6,1,"A419",6,2,"E872",6,3,"L031",6,4,"N189",6,5,"D696",,,,,,,,,,,,,,,,,,,,,,,,,,,,,,,,,,8,"A419","D696","E872","I259","I429","I48","L031","N189",,,,,,,,,,,,,8,,,2,4,998,9
1,99,,0,1,"F",1083,,42,22,10,,1,"W",6,2005,"U",,"U","N",,,"L031",308,111,,37,6,1,1,"A419",2,1,"L031",3,1,"R630",6,1,"I500",6,2,"J189",6,3,"R54",,,,,,,,,,,,,,,,,,,,,,,,,,,,,,,,,,,,,,,,,,,6,"A419","I500","J189","L031","R54","R630",,,,,,,,,,,,,,,8,,,2,4,998,9
1,99,,0,1,"M",1078,,41,21,10,,3,"M",6,2005,"U",,"U","N",,,"C719",122,36,,15,2,1,1,"C719",6,1,"I64",,,,,,,,,,,,,,,,,,,,,,,,,,,,,,,,,,,,,,,,,,,,,,,,,,,,,,,2,"C719","I64",,,,,,,,,,,,,,,,,,,8,,,2,4,998,9
1,99,,0,1,"M",1075,,41,21,10,,3,"M",2,2005,"U",,"U","N",,,"E149",159,46,,16,3,1,1,"I64",2,1,"E149",6,1,"I10",,,,,,,,,,,,,,,,,,,,,,,,,,,,,,,,,,,,,,,,,,,,,,,,,,,,3,"E149","I10","I64",,,,,,,,,,,,,,,,,,8,,,2,4,998,9
1,99,,0,1,"M",1087,,43,23,11,,1,"M",2,2005,"U",,"U","N",,,"I64",238,70,,24,6,1,1,"A419",2,1,"J182",3,1,"E86",3,2,"I48",4,1,"I64",4,2,"G309",,,,,,,,,,,,,,,,,,,,,,,,,,,,,,,,,,,,,,,,,,,6,"A419","E86","G309","I48","I64","J182",,,,,,,,,,,,,,,8,,,2,4,998,9
1,99,,0,1,"M",1059,,37,17,8,,3,"M",1,2005,"U",,"U","N",,,"J459",268,85,,28,3,1,1,"I469",6,1,"J459",6,2,"M109",,,,,,,,,,,,,,,,,,,,,,,,,,,,,,,,,,,,,,,,,,,,,,,,,,,,3,"I469","J459","M109",,,,,,,,,,,,,,,,,,8,,,2,4,998,9
1,99,,0,1,"M",1060,,38,18,8,,1,"M",7,2005,"U",,"U","N",,,"J80",278,89,,37,7,1,1,"K922",2,1,"J80",3,1,"J969",6,1,"A419",6,2,"N189",6,3,"I10",6,4,"E149",,,,,,,,,,,,,,,,,,,,,,,,,,,,,,,,,,,,,,,,7,"A419","E149","I10","J80","J969","K922","N189",,,,,,,,,,,,,,8,,,2,4,998,9
1,99,,0,1,"M",1037,,33,13,6,,1,"S",4,2005,"U",,"U","U",,,"I619",236,70,,24,2,1,1,"I619",2,1,"I10",,,,,,,,,,,,,,,,,,,,,,,,,,,,,,,,,,,,,,,,,,,,,,,,,,,,,,,2,"I10","I619",,,,,,,,,,,,,,,,,,,8,,,2,4,998,9
1,99,,0,1,"M",1038,,33,13,6,,1,"S",2,2005,"U",,"U","N",,,"N180",327,100,,31,1,1,1,"N180",,,,,,,,,,,,,,,,,,,,,,,,,,,,,,,,,,,,,,,,,,,,,,,,,,,,,,,,,,1,"N180",,,,,,,,,,,,,,,,,,,,8,,,2,4,998,9
1,99,,0,1,"M",1051,,36,16,7,,1,"S",1,2005,"U",,"U","U",,,"I429",227,68,,22,7,1,1,"I429",2,1,"R99",3,1,"J81",4,1,"I509",6,1,"E119",6,2,"I10",6,3,"M109",,,,,,,,,,,,,,,,,,,,,,,,,,,,,,,,,,,,,,,,7,"E119","I10","I429","I509","J81","M109","R99",,,,,,,,,,,,,,8,,,2,4,998,9
1,99,,0,1,"F",2007,,18,2,1,18,1,"S",7,2005,"U",,"U","N",,,"K529",295,111,64,37,4,1,1,"I469",2,1,"E86",2,2,"K529",6,1,"J450",,,,,,,,,,,,,,,,,,,,,,,,,,,,,,,,,,,,,,,,,,,,,,,,,4,"E86","I469","J450","K529",,,,,,,,,,,,,,,,,8,,,2,4,998,9
1,99,,0,1,"F",1066,,39,19,9,,1,"M",5,2005,"U",,"U","N",,,"E119",159,46,,16,5,1,1,"A419",2,1,"E119",3,1,"I64",3,2,"G819",6,1,"I10",,,,,,,,,,,,,,,,,,,,,,,,,,,,,,,,,,,,,,,,,,,,,,5,"A419","E119","G819","I10","I64",,,,,,,,,,,,,,,,8,,,2,4,998,9
1,99,,0,1,"F",1080,,42,22,10,,1,"W",2,2005,"U",,"U","N",,,"C349",93,27,,8,3,1,1,"I469",2,1,"C349",3,1,"J189",,,,,,,,,,,,,,,,,,,,,,,,,,,,,,,,,,,,,,,,,,,,,,,,,,,,3,"C349","I469","J189",,,,,,,,,,,,,,,,,,8,,,2,4,998,9
1,99,,0,1,"M",1070,,40,20,9,,1,"M",5,2005,"U",,"U","N",,9,"J449",267,86,,28,5,1,1,"J969",2,1,"I269",3,1,"J449",6,1,"S720",6,2,"X59",,,,,,,,,,,,,,,,,,,,,,,,,,,,,,,,,,,,,,,,,,,,,,5,"I269","J449","J969","S720","X59",,,,,,,,,,,,,,,,8,,,2,4,998,9
4,99,,0,1,"F",1057,,37,17,8,,1,"W",6,2005,"U",,"U","N",,,"I110",207,56,,20,4,1,1,"J969",2,1,"I500",3,1,"I10",6,1,"N179",,,,,,,,,,,,,,,,,,,,,,,,,,,,,,,,,,,,,,,,,,,,,,,,,4,"I10","I500","J969","N179",,,,,,,,,,,,,,,,,8,,,2,4,998,9
1,99,,0,1,"M",1069,,39,19,9,,1,"M",7,2005,"U",,"U","N",,,"R99",379,110,,36,1,1,1,"R99",,,,,,,,,,,,,,,,,,,,,,,,,,,,,,,,,,,,,,,,,,,,,,,,,,,,,,,,,,1,"R99",,,,,,,,,,,,,,,,,,,,8,,,2,4,998,9
1,99,,0,1,"M",1058,,37,17,8,,1,"M",1,2005,"U",,"U","N",,,"I219",211,59,,21,6,1,1,"I469",2,1,"I219",6,1,"I10",6,2,"E780",6,3,"F179",6,4,"C61",,,,,,,,,,,,,,,,,,,,,,,,,,,,,,,,,,,,,,,,,,,6,"C61","E780","F179","I10","I219","I469",,,,,,,,,,,,,,,8,,,2,4,998,9
1,99,,0,1,"M",1005,,27,7,3,,1,"S",5,2005,"U",,"U","N",,,"J984",278,89,,37,4,1,1,"I629",1,2,"I614",2,1,"R048",3,1,"J984",,,,,,,,,,,,,,,,,,,,,,,,,,,,,,,,,,,,,,,,,,,,,,,,,3,"I614","J984","R048",,,,,,,,,,,,,,,,,,8,,,2,4,998,9
1,99,,0,1,"M",1062,,38,18,8,,1,"M",1,2005,"U",,"U","U",,,"I609",235,70,,24,7,1,1,"I609",6,1,"I10",6,2,"N180",6,3,"I500",6,4,"E669",6,5,"E785",6,6,"M109",,,,,,,,,,,,,,,,,,,,,,,,,,,,,,,,,,,,,,,,6,"E669","E785","I120","I500","I609","M109",,,,,,,,,,,,,,,8,,,2,4,998,9
1,99,,0,1,"F",1083,,42,22,10,,1,"S",3,2005,"U",,"U","N",9,9,"W80",410,123,,39,4,1,1,"J969",2,1,"T179",2,2,"W80",6,1,"I48",,,,,,,,,,,,,,,,,,,,,,,,,,,,,,,,,,,,,,,,,,,,,,,,,4,"I48","J969","T179","W80",,,,,,,,,,,,,,,,,8,,,2,4,998,9
1,99,,0,1,"M",1048,,35,15,7,,1,"M",5,2005,"U",,"U","N",,,"I619",236,70,,24,2,1,1,"I619",2,1,"I10",,,,,,,,,,,,,,,,,,,,,,,,,,,,,,,,,,,,,,,,,,,,,,,,,,,,,,,2,"I10","I619",,,,,,,,,,,,,,,,,,,8,,,2,4,998,9
1,99,,0,1,"M",1094,,44,24,11,,3,"W",5,2005,"U",,"U","N",,,"D649",152,45,,37,2,2,1,"N189",3,1,"D649",,,,,,,,,,,,,,,,,,,,,,,,,,,,,,,,,,,,,,,,,,,,,,,,,,,,,,,2,"D649","N189",,,,,,,,,,,,,,,,,,,8,,,2,4,998,9
1,99,,0,1,"M",1042,,34,14,6,,3,"M",5,2005,"U",,"U","N",,,"I120",208,69,,23,4,1,1,"N180",2,1,"J969",3,1,"I10",6,1,"E149",,,,,,,,,,,,,,,,,,,,,,,,,,,,,,,,,,,,,,,,,,,,,,,,,3,"E149","I120","J969",,,,,,,,,,,,,,,,,,8,,,2,4,998,9
1,99,,0,1,"M",1057,,37,17,8,,1,"M",5,2005,"U",,"U","N",,,"J449",267,86,,28,7,1,1,"J988",2,1,"J960",2,2,"J961",6,1,"I500",6,2,"J449",6,3,"E119",6,4,"I10",,,,,,,,,,,,,,,,,,,,,,,,,,,,,,,,,,,,,,,,7,"E119","I10","I500","J449","J960","J961","J988",,,,,,,,,,,,,,8,,,2,4,998,9
1,99,,0,1,"F",1044,,34,14,6,,1,"M",5,2005,"U",,"U","N",,,"N180",327,100,,31,4,1,1,"J969",2,1,"T828",2,2,"Y832",3,1,"N180",,,,,,,,,,,,,,,,,,,,,,,,,,,,,,,,,,,,,,,,,,,,,,,,,4,"J969","N180","T828","Y832",,,,,,,,,,,,,,,,,8,,,2,4,998,9
1,99,,0,1,"M",1063,,38,18,8,,1,"M",6,2005,"U",,"U","U",,,"J969",278,89,,37,1,1,1,"J969",,,,,,,,,,,,,,,,,,,,,,,,,,,,,,,,,,,,,,,,,,,,,,,,,,,,,,,,,,1,"J969",,,,,,,,,,,,,,,,,,,,8,,,2,4,998,9
1,99,,0,1,"F",1032,,32,12,5,,1,"M",7,2005,"U",,"U","N",,,"J189",257,78,,27,4,1,1,"R092",2,1,"J189",6,1,"E872",6,2,"E149",,,,,,,,,,,,,,,,,,,,,,,,,,,,,,,,,,,,,,,,,,,,,,,,,3,"E141","J189","R092",,,,,,,,,,,,,,,,,,8,,,2,4,998,9
1,99,,0,2,"M",1045,,35,15,7,,1,"M",3,2005,"U",,"U","N",,,"I219",211,59,,21,4,1,1,"I219",6,1,"N180",6,2,"I10",6,3,"E213",,,,,,,,,,,,,,,,,,,,,,,,,,,,,,,,,,,,,,,,,,,,,,,,,3,"E213","I120","I219",,,,,,,,,,,,,,,,,,8,,,2,4,998,9
1,99,,0,2,"M",1007,,27,7,3,,3,"S",7,2005,"U",,"U","N",,,"G809",193,111,,37,3,1,1,"J969",2,1,"G809",3,1,"R64",,,,,,,,,,,,,,,,,,,,,,,,,,,,,,,,,,,,,,,,,,,,,,,,,,,,3,"G809","J969","R64",,,,,,,,,,,,,,,,,,8,,,2,4,998,9
1,99,,0,2,"F",1082,,42,22,10,,1,"S",1,2005,"U",,"U","N",,,"L89",309,111,,37,2,1,1,"A419",2,1,"L89",,,,,,,,,,,,,,,,,,,,,,,,,,,,,,,,,,,,,,,,,,,,,,,,,,,,,,,2,"A419","L89",,,,,,,,,,,,,,,,,,,8,,,2,4,998,9
1,99,,0,2,"M",1081,,42,22,10,,3,"W",2,2005,"U",,"U","N",,,"C169",78,22,,5,3,1,1,"C169",2,1,"D649",6,1,"E86",,,,,,,,,,,,,,,,,,,,,,,,,,,,,,,,,,,,,,,,,,,,,,,,,,,,3,"C169","D649","E86",,,,,,,,,,,,,,,,,,8,,,2,4,998,9
1,99,,0,2,"M",1055,,37,17,8,,1,"M",4,2005,"U",,"U","N",,,"C349",93,27,,8,1,1,1,"C349",,,,,,,,,,,,,,,,,,,,,,,,,,,,,,,,,,,,,,,,,,,,,,,,,,,,,,,,,,1,"C349",,,,,,,,,,,,,,,,,,,,8,,,2,4,998,9
1,99,,0,2,"M",1084,,42,22,10,,1,"S",6,2005,"U",,"U","N",,,"I48",228,68,,22,3,1,1,"J969",2,1,"I269",3,1,"I48",,,,,,,,,,,,,,,,,,,,,,,,,,,,,,,,,,,,,,,,,,,,,,,,,,,,3,"I269","I48","J969",,,,,,,,,,,,,,,,,,8,,,2,4,998,9
1,99,,0,2,"M",1077,,41,21,10,,3,"M",6,2005,"U",,"U","N",,,"E149",159,46,,16,3,1,1,"I251",2,1,"E149",2,2,"N189",,,,,,,,,,,,,,,,,,,,,,,,,,,,,,,,,,,,,,,,,,,,,,,,,,,,3,"E149","I251","N189",,,,,,,,,,,,,,,,,,8,,,2,4,998,9
1,99,,0,2,"M",1072,,40,20,9,,3,"M",1,2005,"U",,"U","U",,,"R99",379,110,,36,1,1,1,"R99",,,,,,,,,,,,,,,,,,,,,,,,,,,,,,,,,,,,,,,,,,,,,,,,,,,,,,,,,,1,"R99",,,,,,,,,,,,,,,,,,,,8,,,2,4,998,9
1,99,,0,2,"M",1052,,36,16,7,,1,"M",2,2005,"U",,"U","N",,,"I219",211,59,,21,5,1,1,"I469",2,1,"I499",2,2,"I219",6,1,"J960",6,2,"R570",,,,,,,,,,,,,,,,,,,,,,,,,,,,,,,,,,,,,,,,,,,,,,5,"I219","I469","I499","J960","R570",,,,,,,,,,,,,,,,8,,,2,4,998,9
1,99,,0,2,"M",1060,,38,18,8,,1,"M",4,2005,"U",,"U","N",,,"J188",257,78,,27,7,1,1,"J969",2,1,"J188",6,1,"R17",6,2,"D696",6,3,"N179",6,4,"E872",6,5,"I48",,,,,,,,,,,,,,,,,,,,,,,,,,,,,,,,,,,,,,,,7,"D696","E872","I48","J188","J969","N179","R17",,,,,,,,,,,,,,8,,,2,4,998,9
1,99,,0,2,"F",1089,,43,23,11,,3,"W",4,2005,"U",,"U","U",,,"I251",215,63,,21,3,1,1,"I251",2,1,"I48",3,1,"I10",,,,,,,,,,,,,,,,,,,,,,,,,,,,,,,,,,,,,,,,,,,,,,,,,,,,3,"I10","I251","I48",,,,,,,,,,,,,,,,,,8,,,2,4,998,9
1,99,,0,2,"F",4008,,9,1,1,9,1,"S",5,2005,"U",,"U","N",,,"P240",362,108,99,33,1,1,1,"P240",,,,,,,,,,,,,,,,,,,,,,,,,,,,,,,,,,,,,,,,,,,,,,,,,,,,,,,,,,1,"P240",,,,,,,,,,,,,,,,,,,,8,,,2,4,998,9
1,99,,0,2,"M",1036,,33,13,6,,1,"D",5,2005,"U",,"U","N",,,"N390",330,111,,37,11,1,1,"J960",2,1,"A419",3,1,"N390",3,2,"J189",6,1,"N179",6,2,"N189",6,3,"E875",6,4,"E872",6,5,"I500",6,6,"I10",6,7,"E149",,,,,,,,,,,,,,,,,,,,,,,,,,,,10,"A419","E141","E875","I10","I500","J189","J960","N179","N189","N390",,,,,,,,,,,8,,,2,4,998,9
1,99,,0,2,"F",1077,,41,21,10,,1,"M",4,2005,"U",,"U","N",,,"N390",330,111,,37,8,1,1,"N19",2,1,"N179",3,1,"N390",6,1,"I639",6,2,"G931",6,3,"R068",6,4,"I10",6,5,"I48",,,,,,,,,,,,,,,,,,,,,,,,,,,,,,,,,,,,,7,"G931","I10","I48","I639","N179","N390","R068",,,,,,,,,,,,,,8,,,2,4,998,9
1,99,,0,2,"M",4006,,8,1,1,8,1,"S",3,2005,"U",,"U","N",,,"Q390",372,109,126,34,3,1,1,"P219",2,1,"Q390",3,1,"J398",,,,,,,,,,,,,,,,,,,,,,,,,,,,,,,,,,,,,,,,,,,,,,,,,,,,3,"J398","P219","Q390",,,,,,,,,,,,,,,,,,8,,,2,4,998,9
1,99,,0,2,"F",1078,,41,21,10,,1,"W",7,2005,"U",,"U","N",,,"I48",228,68,,22,9,2,1,"I500",3,1,"I48",6,1,"J961",6,2,"J449",6,3,"E46",6,4,"L511",6,5,"N189",6,6,"D649",6,7,"D469",,,,,,,,,,,,,,,,,,,,,,,,,,,,,,,,,,9,"D469","D649","E46","I48","I500","J449","J961","L511","N189",,,,,,,,,,,,8,,,2,4,998,9
1,99,,0,2,"F",1033,,32,12,5,,1,"S",1,2005,"U",,"U","N",,,"I609",235,70,,24,7,1,1,"I611",1,2,"I64",2,1,"I609",3,1,"I10",6,1,"E668",6,2,"N179",6,3,"K720",,,,,,,,,,,,,,,,,,,,,,,,,,,,,,,,,,,,,,,,6,"E668","I10","I609","I611","K720","N179",,,,,,,,,,,,,,,8,,,2,4,998,9
1,99,,0,3,"M",1061,,38,18,8,,1,"S",3,2005,"U",,"U","N",,,"J449",267,86,,28,6,1,1,"J449",1,2,"I272",1,3,"J841",1,4,"I279",2,1,"N179",3,1,"E46",,,,,,,,,,,,,,,,,,,,,,,,,,,,,,,,,,,,,,,,,,,5,"E46","I272","J449","J841","N179",,,,,,,,,,,,,,,,8,,,2,4,998,9
1,99,,0,3,"M",1050,,36,16,7,,1,"M",5,2005,"U",,"U","N",,,"I64",238,70,,24,3,1,1,"I64",2,1,"I10",6,1,"E149",,,,,,,,,,,,,,,,,,,,,,,,,,,,,,,,,,,,,,,,,,,,,,,,,,,,3,"E149","I10","I64",,,,,,,,,,,,,,,,,,8,,,2,4,998,9
1,99,,0,3,"M",1068,,39,19,9,,1,"S",1,2005,"U",,"U","N",,,"B948",68,18,,37,3,1,1,"K746",2,1,"J449",3,1,"B948",,,,,,,,,,,,,,,,,,,,,,,,,,,,,,,,,,,,,,,,,,,,,,,,,,,,3,"B948","J449","K746",,,,,,,,,,,,,,,,,,8,,,2,4,998,9
1,99,,0,3,"F",1052,,36,16,7,,3,"M",5,2005,"U",,"U","U",,,"E149",159,46,,16,3,1,1,"N180",2,1,"I10",3,1,"E149",,,,,,,,,,,,,,,,,,,,,,,,,,,,,,,,,,,,,,,,,,,,,,,,,,,,2,"E149","I120",,,,,,,,,,,,,,,,,,,8,,,2,4,998,9
1,99,,0,3,"M",1076,,41,21,10,,1,"S",2,2005,"U",3,"U","Y",9,,"V892",397,114,,38,10,1,1,"J984",2,1,"T791",2,2,"S061",2,3,"S069",3,1,"S097",3,2,"T099",3,3,"T149",4,1,"V892",6,1,"I213",6,2,"I709",,,,,,,,,,,,,,,,,,,,,,,,,,,,,,,10,"I213","I709","J984","S061","S069","S097","T099","T149","T791","V892",,,,,,,,,,,8,,,2,4,998,9
1,99,,0,3,"F",1068,,39,19,9,,1,"M",3,2005,"U",,"U","N",,,"A419",23,10,,37,5,1,1,"A419",2,1,"A419",3,1,"J189",6,1,"A419",6,2,"K659",,,,,,,,,,,,,,,,,,,,,,,,,,,,,,,,,,,,,,,,,,,,,,3,"A419","J189","K659",,,,,,,,,,,,,,,,,,8,,,2,4,998,9
1,99,,0,3,"F",1047,,35,15,7,,1,"M",3,2005,"U",,"U","N",,,"I219",211,59,,21,3,1,1,"I219",2,1,"J81",3,1,"I500",,,,,,,,,,,,,,,,,,,,,,,,,,,,,,,,,,,,,,,,,,,,,,,,,,,,3,"I219","I500","J81",,,,,,,,,,,,,,,,,,8,,,2,4,998,9
1,99,,0,3,"F",1080,,42,22,10,,3,"M",7,2005,"U",,"U","N",,,"J459",268,85,,28,2,1,1,"J459",1,2,"J449",,,,,,,,,,,,,,,,,,,,,,,,,,,,,,,,,,,,,,,,,,,,,,,,,,,,,,,1,"J448",,,,,,,,,,,,,,,,,,,,8,,,2,4,998,9
1,99,,0,3,"M",1070,,40,20,9,,1,"M",6,2005,"U",,"U","N",,,"J449",267,86,,28,6,1,1,"A419",2,1,"J189",3,1,"J449",6,1,"I251",6,2,"R739",6,3,"D649",,,,,,,,,,,,,,,,,,,,,,,,,,,,,,,,,,,,,,,,,,,6,"A419","D649","I251","J189","J449","R739",,,,,,,,,,,,,,,8,,,2,4,998,9
1,99,,0,3,"F",1073,,40,20,9,,3,"W",7,2005,"U",,"U","N",,,"E780",173,111,,37,3,1,1,"I469",2,1,"I10",3,1,"E780",,,,,,,,,,,,,,,,,,,,,,,,,,,,,,,,,,,,,,,,,,,,,,,,,,,,3,"E780","I10","I469",,,,,,,,,,,,,,,,,,8,,,2,4,998,9
1,99,,0,3,"F",1058,,37,17,8,,1,"W",4,2005,"U",,"U","N",,,"C509",104,29,,9,2,1,1,"C509",1,2,"C80",,,,,,,,,,,,,,,,,,,,,,,,,,,,,,,,,,,,,,,,,,,,,,,,,,,,,,,1,"C509",,,,,,,,,,,,,,,,,,,,8,,,2,4,998,9
1,99,,0,3,"M",1060,,38,18,8,,1,"W",5,2005,"U",,"U","N",,,"C250",88,25,,7,3,1,1,"C250",6,1,"I10",6,2,"E149",,,,,,,,,,,,,,,,,,,,,,,,,,,,,,,,,,,,,,,,,,,,,,,,,,,,3,"C250","E149","I10",,,,,,,,,,,,,,,,,,8,,,2,4,998,9
1,99,,0,3,"M",1072,,40,20,9,,1,"W",7,2005,"U",,"U","N",,,"I219",211,59,,21,10,1,1,"I469",2,1,"I499",2,2,"I472",2,3,"J960",3,1,"I219",3,2,"I64",6,1,"E119",6,2,"C349",6,3,"C782",6,4,"J449",,,,,,,,,,,,,,,,,,,,,,,,,,,,,,,9,"C349","C782","E119","I219","I469","I472","I64","J449","J960",,,,,,,,,,,,8,,,2,4,998,9
1,99,,0,3,"M",1070,,40,20,9,,3,"W",7,2005,"U",,"U","N",,,"C229",85,24,,15,2,1,1,"C229",2,1,"B181",,,,,,,,,,,,,,,,,,,,,,,,,,,,,,,,,,,,,,,,,,,,,,,,,,,,,,,2,"B181","C229",,,,,,,,,,,,,,,,,,,8,,,2,4,998,9
1,99,,0,3,"M",1050,,36,16,7,,3,"S",7,2005,"U",,"U","N",,,"C169",78,22,,5,1,1,1,"C169",,,,,,,,,,,,,,,,,,,,,,,,,,,,,,,,,,,,,,,,,,,,,,,,,,,,,,,,,,1,"C169",,,,,,,,,,,,,,,,,,,,8,,,2,4,998,9
1,99,,0,3,"M",1066,,39,19,9,,6,"W",4,2005,"U",,"U","N",,,"C349",93,27,,8,1,1,1,"C349",,,,,,,,,,,,,,,,,,,,,,,,,,,,,,,,,,,,,,,,,,,,,,,,,,,,,,,,,,1,"C349",,,,,,,,,,,,,,,,,,,,8,,,2,4,998,9
1,99,,0,3,"M",1068,,39,19,9,,1,"M",3,2005,"U",,"U","N",,,"I219",211,59,,21,6,1,1,"I469",2,1,"I219",6,1,"I10",6,2,"K279",6,3,"E785",6,4,"F179",,,,,,,,,,,,,,,,,,,,,,,,,,,,,,,,,,,,,,,,,,,6,"E785","F179","I10","I219","I469","K279",,,,,,,,,,,,,,,8,,,2,4,998,9
1,99,,0,3,"M",1065,,39,19,9,,3,"M",3,2005,"U",,"U","N",,,"E149",159,46,,16,3,1,1,"N19",2,1,"E149",2,2,"I10",,,,,,,,,,,,,,,,,,,,,,,,,,,,,,,,,,,,,,,,,,,,,,,,,,,,3,"E149","I10","N19",,,,,,,,,,,,,,,,,,8,,,2,4,998,9
1,99,,0,3,"M",1054,,36,16,7,,1,"M",6,2005,"U",,"U","U",,,"J931",278,89,,37,3,1,1,"J969",2,1,"J931",6,1,"I10",,,,,,,,,,,,,,,,,,,,,,,,,,,,,,,,,,,,,,,,,,,,,,,,,,,,3,"I10","J931","J969",,,,,,,,,,,,,,,,,,8,,,2,4,998,9
1,99,,0,3,"M",1069,,39,19,9,,1,"W",7,2005,"U",,"U","N",,,"I64",238,70,,24,4,1,1,"I64",2,1,"I10",3,1,"E86",6,1,"I64",,,,,,,,,,,,,,,,,,,,,,,,,,,,,,,,,,,,,,,,,,,,,,,,,3,"E86","I10","I64",,,,,,,,,,,,,,,,,,8,,,2,4,998,9
1,99,,0,3,"M",1062,,38,18,8,,3,"S",6,2005,"U",,"U","N",,,"I219",211,59,,21,1,1,1,"I219",,,,,,,,,,,,,,,,,,,,,,,,,,,,,,,,,,,,,,,,,,,,,,,,,,,,,,,,,,1,"I219",,,,,,,,,,,,,,,,,,,,8,,,2,4,998,9
1,99,,0,3,"F",1086,,43,23,11,,1,"W",5,2005,"U",,"U","N",,,"E149",159,46,,16,5,1,1,"A419",2,1,"E149",2,2,"I10",2,3,"I64",3,1,"N179",,,,,,,,,,,,,,,,,,,,,,,,,,,,,,,,,,,,,,,,,,,,,,5,"A419","E149","I10","I64","N179",,,,,,,,,,,,,,,,8,,,2,4,998,9
1,99,,0,3,"M",1038,,33,13,6,,3,"S",1,2005,"U",3,"U","Y",9,9,"Y09",441,129,,41,9,1,1,"S273",1,2,"S069",2,1,"S065",2,2,"S061",2,3,"S223",2,4,"S360",3,1,"S099",3,2,"Y09",3,3,"S299",,,,,,,,,,,,,,,,,,,,,,,,,,,,,,,,,,9,"S061","S065","S069","S099","S223","S273","S299","S360","Y09",,,,,,,,,,,,8,,,2,4,998,9
1,99,,0,3,"M",1056,,37,17,8,,3,"M",6,2005,"U",,"U","N",9,9,"X59",423,123,,39,3,1,1,"I219",2,1,"S099",6,1,"X59",,,,,,,,,,,,,,,,,,,,,,,,,,,,,,,,,,,,,,,,,,,,,,,,,,,,3,"I219","S099","X59",,,,,,,,,,,,,,,,,,8,,,2,4,998,9
1,99,,0,4,"M",1039,,33,13,6,,1,"M",4,2005,"U",,"U","U",,,"G473",194,111,,37,6,1,1,"G931",2,1,"R092",3,1,"G473",6,1,"E668",6,2,"I48",6,3,"J690",,,,,,,,,,,,,,,,,,,,,,,,,,,,,,,,,,,,,,,,,,,6,"E668","G473","G931","I48","J690","R092",,,,,,,,,,,,,,,8,,,2,4,998,9
1,99,,0,4,"M",1078,,41,21,10,,1,"M",5,2005,"U",,"U","U",,,"J449",267,86,,28,5,1,1,"I678",2,1,"R092",3,1,"J449",6,1,"J690",6,2,"A419",,,,,,,,,,,,,,,,,,,,,,,,,,,,,,,,,,,,,,,,,,,,,,5,"A419","I678","J449","J690","R092",,,,,,,,,,,,,,,,8,,,2,4,998,9
1,99,,0,4,"F",1072,,40,20,9,,2,"W",1,2005,"U",,"U","U",,,"C56",109,32,,10,1,1,1,"C56",,,,,,,,,,,,,,,,,,,,,,,,,,,,,,,,,,,,,,,,,,,,,,,,,,,,,,,,,,1,"C56",,,,,,,,,,,,,,,,,,,,8,,,2,4,998,9
1,99,,0,4,"F",1074,,40,20,9,,1,"W",6,2005,"U",,"U","N",,,"I48",228,68,,22,5,1,1,"R092",2,1,"I500",3,1,"I48",6,1,"R100",6,2,"R99",,,,,,,,,,,,,,,,,,,,,,,,,,,,,,,,,,,,,,,,,,,,,,5,"I48","I500","R092","R100","R99",,,,,,,,,,,,,,,,8,,,2,4,998,9
1,99,,0,4,"F",1079,,41,21,10,,1,"S",2,2005,"U",,"U","U",,,"J189",257,78,,27,6,1,1,"R579",2,1,"A419",2,2,"R579",3,1,"J189",6,1,"N19",6,2,"E86",,,,,,,,,,,,,,,,,,,,,,,,,,,,,,,,,,,,,,,,,,,5,"A419","E86","J189","N19","R579",,,,,,,,,,,,,,,,1,,,1,1,998,9
1,99,,0,4,"F",1087,,43,23,11,,3,"W",6,2005,"U",,"U","U",,,"L89",309,111,,37,1,2,1,"L89",,,,,,,,,,,,,,,,,,,,,,,,,,,,,,,,,,,,,,,,,,,,,,,,,,,,,,,,,,1,"L89",,,,,,,,,,,,,,,,,,,,8,,,2,4,998,9
1,99,,0,4,"M",2002,,13,2,1,13,1,"S",3,2005,"U",,"U","U",,,"J984",278,89,62,37,6,1,1,"R060",2,1,"J984",3,1,"P072",6,1,"P073",6,2,"I615",6,3,"A419",,,,,,,,,,,,,,,,,,,,,,,,,,,,,,,,,,,,,,,,,,,5,"A419","I615","J984","P072","R060",,,,,,,,,,,,,,,,8,,,2,4,998,9
1,99,,0,4,"M",1057,,37,17,8,,1,"M",4,2005,"U",,"U","N",,,"I219",211,59,,21,6,1,1,"I219",6,1,"F102",6,2,"K703",6,3,"E669",6,4,"N179",6,5,"E875",,,,,,,,,,,,,,,,,,,,,,,,,,,,,,,,,,,,,,,,,,,6,"E669","E875","F102","I219","K703","N179",,,,,,,,,,,,,,,8,,,2,4,998,9
1,99,,0,4,"M",1070,,40,20,9,,1,"W",5,2005,"U",,"U","U",,,"R99",379,110,,36,1,1,1,"R99",,,,,,,,,,,,,,,,,,,,,,,,,,,,,,,,,,,,,,,,,,,,,,,,,,,,,,,,,,1,"R99",,,,,,,,,,,,,,,,,,,,8,,,2,4,998,9
1,99,,0,4,"M",1075,,41,21,10,,1,"M",5,2005,"U",,"U","N",,,"I694",239,70,,24,5,1,1,"A419",2,1,"L089",3,1,"I694",6,1,"E46",6,2,"E86",,,,,,,,,,,,,,,,,,,,,,,,,,,,,,,,,,,,,,,,,,,,,,5,"A419","E46","E86","I694","L089",,,,,,,,,,,,,,,,8,,,2,4,998,9
1,99,,0,4,"M",1071,,40,20,9,,3,"M",5,2005,"U",,"U","U",,,"C349",93,27,,8,1,1,1,"C349",,,,,,,,,,,,,,,,,,,,,,,,,,,,,,,,,,,,,,,,,,,,,,,,,,,,,,,,,,1,"C349",,,,,,,,,,,,,,,,,,,,8,,,2,4,998,9
1,99,,0,4,"M",1073,,40,20,9,,3,"M",6,2005,"U",,"U","N",,,"C61",113,33,,11,4,1,1,"C61",2,1,"E119",3,1,"I48",6,1,"E780",,,,,,,,,,,,,,,,,,,,,,,,,,,,,,,,,,,,,,,,,,,,,,,,,4,"C61","E119","E780","I48",,,,,,,,,,,,,,,,,8,,,2,4,998,9
1,99,,0,4,"M",1080,,42,22,10,,1,"W",6,2005,"U",,"U","U",,,"I64",238,70,,24,5,1,1,"R092",2,1,"I48",3,1,"J189",6,1,"E149",6,2,"I64",,,,,,,,,,,,,,,,,,,,,,,,,,,,,,,,,,,,,,,,,,,,,,5,"E149","I48","I64","J189","R092",,,,,,,,,,,,,,,,8,,,2,4,998,9
1,99,,0,4,"F",1069,,39,19,9,,1,"M",1,2005,"U",,"U","N",,,"I64",238,70,,24,7,1,1,"I469",2,1,"I64",3,1,"I10",6,1,"I694",6,2,"G819",6,3,"I10",6,4,"E785",,,,,,,,,,,,,,,,,,,,,,,,,,,,,,,,,,,,,,,,6,"E785","G819","I10","I469","I64","I694",,,,,,,,,,,,,,,8,,,2,4,998,9
1,99,,0,4,"M",1089,,43,23,11,,3,"W",1,2005,"U",,"U","N",,,"I48",228,68,,22,3,1,1,"A419",2,1,"R02",3,1,"I48",,,,,,,,,,,,,,,,,,,,,,,,,,,,,,,,,,,,,,,,,,,,,,,,,,,,3,"A419","I48","R02",,,,,,,,,,,,,,,,,,8,,,2,4,998,9
1,99,,0,4,"M",1081,,42,22,10,,1,"M",1,2005,"U",,"U","N",,,"J449",267,86,,28,4,1,1,"J189",2,1,"J449",2,2,"J841",6,1,"K279",,,,,,,,,,,,,,,,,,,,,,,,,,,,,,,,,,,,,,,,,,,,,,,,,4,"J189","J449","J841","K279",,,,,,,,,,,,,,,,,8,,,2,4,998,9
1,99,,0,4,"M",1077,,41,21,10,,1,"W",2,2005,"U",,"U","U",,,"I64",238,70,,24,2,1,1,"J969",6,1,"I64",,,,,,,,,,,,,,,,,,,,,,,,,,,,,,,,,,,,,,,,,,,,,,,,,,,,,,,2,"I64","J969",,,,,,,,,,,,,,,,,,,8,,,2,4,998,9
1,99,,0,4,"F",1060,,38,18,8,,1,"S",2,2005,"U",,"U","U",,,"C479",103,43,,15,3,1,1,"C780",2,1,"C479",6,1,"Q850",,,,,,,,,,,,,,,,,,,,,,,,,,,,,,,,,,,,,,,,,,,,,,,,,,,,3,"C479","C780","Q850",,,,,,,,,,,,,,,,,,8,,,2,4,998,9
1,99,,0,4,"F",1035,,33,13,6,,1,"M",6,2005,"U",,"U","U",,,"J189",257,78,,27,4,1,1,"J969",2,1,"J90",3,1,"J189",6,1,"I517",,,,,,,,,,,,,,,,,,,,,,,,,,,,,,,,,,,,,,,,,,,,,,,,,4,"I517","J189","J90","J969",,,,,,,,,,,,,,,,,8,,,2,4,998,9
1,99,,0,4,"F",1052,,36,16,7,,1,"M",4,2005,"U",,"U","U",,,"I64",238,70,,24,4,1,1,"J969",2,1,"I64",3,1,"I10",6,1,"E149",,,,,,,,,,,,,,,,,,,,,,,,,,,,,,,,,,,,,,,,,,,,,,,,,4,"E149","I10","I64","J969",,,,,,,,,,,,,,,,,8,,,2,4,998,9
1,99,,0,4,"M",1061,,38,18,8,,3,"M",4,2005,"U",,"U","Y",9,9,"W34",407,119,,39,3,1,1,"S273",2,1,"S219",2,2,"W34",,,,,,,,,,,,,,,,,,,,,,,,,,,,,,,,,,,,,,,,,,,,,,,,,,,,3,"S219","S273","W34",,,,,,,,,,,,,,,,,,8,,,2,4,998,9
1,99,,0,4,"F",1066,,39,19,9,,3,"W",5,2005,"U",,"U","U",,,"E109",159,46,,16,1,2,1,"E109",,,,,,,,,,,,,,,,,,,,,,,,,,,,,,,,,,,,,,,,,,,,,,,,,,,,,,,,,,1,"E109",,,,,,,,,,,,,,,,,,,,8,,,2,4,998,9
1,99,,0,4,"M",1056,,37,17,8,,3,"M",1,2005,"U",,"U","U",,,"I429",227,68,,22,6,1,1,"I500",2,1,"I48",3,1,"I429",4,1,"G473",6,1,"J449",6,2,"E668",,,,,,,,,,,,,,,,,,,,,,,,,,,,,,,,,,,,,,,,,,,6,"E668","G473","I429","I48","I500","J449",,,,,,,,,,,,,,,8,,,2,4,998,9
1,99,,0,4,"M",1079,,41,21,10,,3,"S",2,2005,"U",,"U","Y",,,"I251",215,63,,21,2,1,1,"I119",1,2,"I251",,,,,,,,,,,,,,,,,,,,,,,,,,,,,,,,,,,,,,,,,,,,,,,,,,,,,,,2,"I119","I251",,,,,,,,,,,,,,,,,,,1,,,1,1,998,9
1,99,,0,5,"M",1056,,37,17,8,,1,"S",3,2005,"U",,"U","U",,,"A419",23,10,,37,5,1,1,"J181",2,1,"A419",2,2,"R579",6,1,"F179",6,2,"E669",,,,,,,,,,,,,,,,,,,,,,,,,,,,,,,,,,,,,,,,,,,,,,5,"A419","E669","F179","J181","R579",,,,,,,,,,,,,,,,8,,,2,4,998,9
1,99,,0,5,"M",1086,,43,23,11,,3,"M",5,2005,"U",,"U","U",,,"I251",215,63,,21,2,1,1,"I251",2,1,"R54",,,,,,,,,,,,,,,,,,,,,,,,,,,,,,,,,,,,,,,,,,,,,,,,,,,,,,,2,"I251","R54",,,,,,,,,,,,,,,,,,,8,,,2,4,998,9
1,99,,0,5,"M",1038,,33,13,6,,1,"M",2,2005,"U",,"U","U",,,"A279",24,18,,37,4,1,1,"J969",2,1,"D65",3,1,"A279",6,1,"I48",,,,,,,,,,,,,,,,,,,,,,,,,,,,,,,,,,,,,,,,,,,,,,,,,4,"A279","D65","I48","J969",,,,,,,,,,,,,,,,,8,,,2,4,998,9