"rectype","restatus","stateoc","countyoc","exstatoc","popsizoc","staters","statersr","countyrs","cityrs","popsize","metro","exstares","pmsares","popsizrs","popmsa","cmsares","statbth","statbthr","educ89","educ","educflag","monthdth","sex","age","ageflag","ager52","ager27","ager12","ager22","placdth","marstat","weekday","year","injwork","mandeath","methdisp","autopsy","activity","injury","ucod","ucr358","ucr113","ucr130","ucr39","eanum","econdp_1","econds_1","enicon_1","econdp_2","econds_2","enicon_2","econdp_3","econds_3","enicon_3","econdp_4","econds_4","enicon_4","econdp_5","econds_5","enicon_5","econdp_6","econds_6","enicon_6","econdp_7","econds_7","enicon_7","econdp_8","econds_8","enicon_8","econdp_9","econds_9","enicon_9","econdp_10","econds_10","enicon_10","econdp_11","econds_11","enicon_11","econdp_12","econds_12","enicon_12","econdp_13","econds_13","enicon_13","econdp_14","econds_14","enicon_14","econdp_15","econds_15","enicon_15","econdp_16","econds_16","enicon_16","econdp_17","econds_17","enicon_17","econdp_18","econds_18","enicon_18","econdp_19","econds_19","enicon_19","econdp_20","econds_20","enicon_20","ranum","record_1","record_2","record_3","record_4","record_5","record_6","record_7","record_8","record_9","record_10","record_11","record_12","record_13","record_14","record_15","record_16","record_17","record_18","record_19","record_20","rnifla_20","race","brace","raceimp","racer3","racer2","hispanic","hspanicr"
1,1,"AS","AS000","AS",0,"AS","AS","AS000","99999","9","2","AS","0000","3","9",0,"AS","AS",99,,0,1,"M",1060,,38,18,8,,1,"M",4,2003,"U",,"U","N",,,"C169",78,22,,5,2,1,1,"C169",6,1,"D649",,,,,,,,,,,,,,,,,,,,,,,,,,,,,,,,,,,,,,,,,,,,,,,,,,,,,,,2,"C169","D649",,,,,,,,,,,,,,,,,,,,8,,,2,4,998,9
1,1,"AS","AS000","AS",0,"AS","AS","AS000","99999","9","2","AS","0000","3","9",0,"AS","AS",99,,0,1,"M",2001,,12,2,1,12,1,"S",5,2003,"U",,"U","N",,,"P271",362,108,102,33,4,1,1,"R068",1,2,"R001",2,1,"P073",6,1,"P271",,,,,,,,,,,,,,,,,,,,,,,,,,,,,,,,,,,,,,,,,,,,,,,,,3,"P271","R001","R068",,,,,,,,,,,,,,,,,,,8,,,2,4,998,9
1,1,"AS","AS000","AS",0,"AS","AS","AS000","99999","9","2","AS","0000","3","9",0,"ZZ","YY",99,,0,1,"F",1076,,41,21,10,,3,"W",6,2003,"U",,"U","N",,,"I519",233,68,,22,1,1,1,"I519",,,,,,,,,,,,,,,,,,,,,,,,,,,,,,,,,,,,,,,,,,,,,,,,,,,,,,,,,,1,"I519",,,,,,,,,,,,,,,,,,,,,8,,,2,4,998,9
1,1,"AS","AS000","AS",0,"AS","AS","AS000","99999","9","2","AS","0000","3","9",0,"AS","AS",99,,0,1,"F",1083,,42,22,10,,1,"W",1,2003,"U",,"U","N",,,"I259",215,63,,21,4,1,1,"I500",2,1,"I429",3,1,"I259",6,1,"J189",,,,,,,,,,,,,,,,,,,,,,,,,,,,,,,,,,,,,,,,,,,,,,,,,4,"I259","I429","I500","J189",,,,,,,,,,,,,,,,,,8,,,2,4,998,9
1,1,"AS","AS000","AS",0,"AS","AS","AS000","99999","9","2","AS","0000","3","9",0,"AS","AS",99,,0,1,"F",5999,,1,1,1,1,1,"S",3,2003,"U",,"U","N",,,"Q042",368,109,122,34,1,1,1,"Q042",,,,,,,,,,,,,,,,,,,,,,,,,,,,,,,,,,,,,,,,,,,,,,,,,,,,,,,,,,1,"Q042",,,,,,,,,,,,,,,,,,,,,8,,,2,4,998,9
1,1,"AS","AS000","AS",0,"AS","AS","AS000","99999","9","2","AS","0000","3","9",0,"ZZ","YY",99,,0,1,"F",1071,,40,20,9,,1,"W",4,2003,"U",,"U","N",,,"I619",236,70,,24,4,1,1,"I619",6,1,"I10",6,2,"E109",6,3,"N390",,,,,,,,,,,,,,,,,,,,,,,,,,,,,,,,,,,,,,,,,,,,,,,,,4,"E109","I10","I619","N390",,,,,,,,,,,,,,,,,,8,,,2,4,998,9
1,1,"AS","AS000","AS",0,"AS","AS","AS000","99999","9","2","AS","0000","3","9",0,"ZZ","YY",99,,0,1,"F",1057,,37,17,8,,1,"M",5,2003,"U",,"U","N",,,"E140",159,46,,16,4,1,1,"R092",2,1,"R402",3,1,"E149",4,1,"I10",,,,,,,,,,,,,,,,,,,,,,,,,,,,,,,,,,,,,,,,,,,,,,,,,3,"E140","I10","R092",,,,,,,,,,,,,,,,,,,8,,,2,4,998,9
1,1,"AS","AS000","AS",0,"AS","AS","AS000","99999","9","2","AS","0000","3","9",0,"AS","AS",99,,0,1,"M",1066,,39,19,9,,1,"M",2,2003,"U",,"U","N",,,"M102",313,111,,37,4,1,1,"I469",2,1,"K922",3,1,"Y453",3,2,"M102",,,,,,,,,,,,,,,,,,,,,,,,,,,,,,,,,,,,,,,,,,,,,,,,,4,"I469","K922","M102","Y453",,,,,,,,,,,,,,,,,,8,,,2,4,998,9
1,1,"AS","AS000","AS",0,"AS","AS","AS000","99999","9","2","AS","0000","3","9",0,"AS","AS",99,,0,1,"M",1071,,40,20,9,,3,"M",6,2003,"U",,"U","N",,,"E149",159,46,,16,3,1,1,"N19",2,1,"E149",3,1,"I10",,,,,,,,,,,,,,,,,,,,,,,,,,,,,,,,,,,,,,,,,,,,,,,,,,,,3,"E149","I10","N19",,,,,,,,,,,,,,,,,,,8,,,2,4,998,9
1,1,"AS","AS000","AS",0,"AS","AS","AS000","99999","9","2","AS","0000","3","9",0,"AS","AS",99,,0,1,"M",1069,,39,19,9,,1,"M",1,2003,"U",,"U","N",,,"K810",302,96,,37,6,1,1,"K810",2,1,"N179",3,1,"N189",6,1,"J189",6,2,"E149",6,3,"I10",,,,,,,,,,,,,,,,,,,,,,,,,,,,,,,,,,,,,,,,,,,6,"E149","I10","J189","K810","N179","N189",,,,,,,,,,,,,,,,8,,,2,4,998,9
1,1,"AS","AS000","AS",0,"AS","AS","AS000","99999","9","2","AS","0000","3","9",0,"ZZ","YY",99,,0,1,"M",1075,,41,21,10,,1,"M",1,2003,"U",,"U","N",,,"I619",236,70,,24,9,1,1,"A419",2,1,"J189",2,2,"L89",6,1,"D649",6,2,"K922",6,3,"I619",6,4,"I64",6,5,"I693",6,6,"I10",,,,,,,,,,,,,,,,,,,,,,,,,,,,,,,,,,8,"A419","D649","I10","I619","I693","J189","K922","L89",,,,,,,,,,,,,,8,,,2,4,998,9
1,1,"AS","AS000","AS",0,"AS","AS","AS000","99999","9","2","AS","0000","3","9",0,"AS","AS",99,,0,1,"M",1050,,36,16,7,,3,"M",5,2003,"U",,"U","N",9,9,"W74",409,120,,39,2,1,1,"T751",1,2,"W74",,,,,,,,,,,,,,,,,,,,,,,,,,,,,,,,,,,,,,,,,,,,,,,,,,,,,,,2,"T751","W74",,,,,,,,,,,,,,,,,,,,8,,,2,4,998,9
1,1,"AS","AS000","AS",0,"AS","AS","AS000","99999","9","2","AS","0000","3","9",0,"AS","AS",99,,0,1,"F",1091,,44,24,11,,1,"W",6,2003,"U",,"U","N",,,"M199",313,111,,37,6,1,1,"I639",2,1,"T817",6,1,"N390",6,2,"J439",6,3,"M199",6,4,"Y834",,,,,,,,,,,,,,,,,,,,,,,,,,,,,,,,,,,,,,,,,,,6,"I639","J439","M199","N390","T817","Y834",,,,,,,,,,,,,,,,8,,,2,4,998,9
1,1,"AS","AS000","AS",0,"AS","AS","AS000","99999","9","2","AS","0000","3","9",0,"ZZ","YY",99,,0,1,"M",1038,,33,13,6,,3,"M",6,2003,"U",,"U","N",,,"A419",23,10,,37,5,1,1,"I219",2,1,"A419",6,1,"E668",6,2,"I500",6,3,"N19",,,,,,,,,,,,,,,,,,,,,,,,,,,,,,,,,,,,,,,,,,,,,,5,"A419","E668","I219","I500","N19",,,,,,,,,,,,,,,,,8,,,2,4,998,9
1,1,"AS","AS000","AS",0,"AS","AS","AS000","99999","9","2","AS","0000","3","9",0,"ZZ","YY",99,,0,1,"F",1054,,36,16,7,,1,"M",4,2003,"U",,"U","N",,,"C169",78,22,,5,4,1,1,"C169",6,1,"K279",6,2,"E149",6,3,"I10",,,,,,,,,,,,,,,,,,,,,,,,,,,,,,,,,,,,,,,,,,,,,,,,,4,"C169","E149","I10","K279",,,,,,,,,,,,,,,,,,8,,,2,4,998,9
1,1,"AS","AS000","AS",0,"AS","AS","AS000","99999","9","2","AS","0000","3","9",0,"AS","AS",99,,0,1,"M",1058,,37,17,8,,1,"M",6,2003,"U",,"U","N",,,"K274",286,90,,29,6,1,1,"R571",2,1,"K922",3,1,"K279",6,1,"I359",6,2,"I429",6,3,"M100",,,,,,,,,,,,,,,,,,,,,,,,,,,,,,,,,,,,,,,,,,,5,"I359","I429","K274","M100","R571",,,,,,,,,,,,,,,,,8,,,2,4,998,9
1,1,"AS","AS000","AS",0,"AS","AS","AS000","99999","9","2","AS","0000","3","9",0,"ZZ","YY",99,,0,1,"F",1081,,42,22,10,,1,"W",2,2003,"U",,"U","N",,,"I64",238,70,,24,4,1,1,"J81",2,1,"J969",3,1,"R068",6,1,"I64",,,,,,,,,,,,,,,,,,,,,,,,,,,,,,,,,,,,,,,,,,,,,,,,,4,"I64","J81","J969","R068",,,,,,,,,,,,,,,,,,8,,,2,4,998,9
1,1,"AS","AS000","AS",0,"AS","AS","AS000","99999","9","2","AS","0000","3","9",0,"ZZ","YY",99,,0,2,"F",1063,,38,18,8,,1,"W",7,2003,"U",,"U","N",,,"C509",104,29,,9,7,1,1,"C509",1,2,"C795",1,3,"C780",1,4,"C787",1,5,"D619",6,1,"I10",6,2,"E785",,,,,,,,,,,,,,,,,,,,,,,,,,,,,,,,,,,,,,,,7,"C509","C780","C787","C795","D619","E785","I10",,,,,,,,,,,,,,,8,,,2,4,998,9
1,1,"AS","AS000","AS",0,"AS","AS","AS000","99999","9","2","AS","0000","3","9",0,"ZZ","ZZ",99,,0,2,"F",1098,,45,25,11,,3,"D",1,2003,"U",,"U","N",,,"I251",215,63,,21,2,1,1,"R54",2,1,"I251",,,,,,,,,,,,,,,,,,,,,,,,,,,,,,,,,,,,,,,,,,,,,,,,,,,,,,,2,"I251","R54",,,,,,,,,,,,,,,,,,,,1,,,1,1,998,9
1,1,"AS","AS000","AS",0,"AS","AS","AS000","99999","9","2","AS","0000","3","9",0,"ZZ","YY",99,,0,2,"F",1068,,39,19,9,,1,"W",4,2003,"U",,"U","N",,,"J180",257,78,,27,6,1,1,"R402",2,1,"A419",2,2,"R068",3,1,"J180",6,1,"E119",6,2,"I10",,,,,,,,,,,,,,,,,,,,,,,,,,,,,,,,,,,,,,,,,,,5,"A419","E110","I10","J180","R068",,,,,,,,,,,,,,,,,8,,,2,4,998,9
1,1,"AS","AS000","AS",0,"AS","AS","AS000","99999","9","2","AS","0000","3","9",0,"AS","AS",99,,0,2,"M",1074,,40,20,9,,1,"S",4,2003,"U",,"U","N",,,"I619",236,70,,24,2,1,1,"I619",2,1,"I10",,,,,,,,,,,,,,,,,,,,,,,,,,,,,,,,,,,,,,,,,,,,,,,,,,,,,,,2,"I10","I619",,,,,,,,,,,,,,,,,,,,8,,,2,4,998,9
1,1,"AS","AS000","AS",0,"AS","AS","AS000","99999","9","2","AS","0000","3","9",0,"AS","AS",99,,0,2,"F",1058,,37,17,8,,1,"M",7,2003,"U",,"U","N",,,"C19",82,23,,6,7,1,1,"C19",1,2,"C787",1,3,"C793",3,1,"J960",6,1,"E880",6,2,"R601",6,3,"E119",,,,,,,,,,,,,,,,,,,,,,,,,,,,,,,,,,,,,,,,7,"C19","C787","C793","E119","E880","J960","R601",,,,,,,,,,,,,,,8,,,2,4,998,9
1,1,"AS","AS000","AS",0,"AS","AS","AS000","99999","9","2","AS","0000","3","9",0,"AS","AS",99,,0,2,"F",1001,,23,3,2,,3,"S",1,2003,"U",,"U","N",,,"R960",379,110,,36,1,1,1,"R960",,,,,,,,,,,,,,,,,,,,,,,,,,,,,,,,,,,,,,,,,,,,,,,,,,,,,,,,,,1,"R960",,,,,,,,,,,,,,,,,,,,,8,,,2,4,998,9
1,1,"AS","AS000","AS",0,"AS","AS","AS000","99999","9","2","AS","0000","3","9",0,"ZZ","YY",99,,0,2,"M",1076,,41,21,10,,3,"W",2,2003,"U",,"U","N",,,"E86",172,111,,37,1,3,1,"E86",,,,,,,,,,,,,,,,,,,,,,,,,,,,,,,,,,,,,,,,,,,,,,,,,,,,,,,,,,1,"E86",,,,,,,,,,,,,,,,,,,,,8,,,2,4,998,9
1,1,"AS","AS000","AS",0,"AS","AS","AS000","99999","9","2","AS","0000","3","9",0,"AS","AS",99,,0,2,"F",1078,,41,21,10,,3,"W",2,2003,"U",,"U","N",,,"C56",109,32,,10,2,1,1,"I469",2,1,"C56",,,,,,,,,,,,,,,,,,,,,,,,,,,,,,,,,,,,,,,,,,,,,,,,,,,,,,,2,"C56","I469",,,,,,,,,,,,,,,,,,,,8,,,2,4,998,9
1,1,"AS","AS000","AS",0,"AS","AS","AS000","99999","9","2","AS","0000","3","9",0,"AS","AS",99,,0,2,"F",5999,,1,1,1,1,1,"S",2,2003,"U",,"U","N",,,"P072",358,108,89,33,1,2,1,"P072",,,,,,,,,,,,,,,,,,,,,,,,,,,,,,,,,,,,,,,,,,,,,,,,,,,,,,,,,,1,"P072",,,,,,,,,,,,,,,,,,,,,8,,,2,4,998,9
1,1,"AS","AS000","AS",0,"AS","AS","AS000","99999","9","2","AS","0000","3","9",0,"AS","AS",99,,0,2,"M",2010,,21,2,1,21,1,"S",2,2003,"U",,"U","N",,,"P548",364,108,110,33,5,1,1,"P240",2,1,"P290",3,1,"P548",6,1,"P082",6,2,"P073",,,,,,,,,,,,,,,,,,,,,,,,,,,,,,,,,,,,,,,,,,,,,,3,"P240","P290","P548",,,,,,,,,,,,,,,,,,,8,,,2,4,998,9
1,1,"AS","AS000","AS",0,"AS","AS","AS000","99999","9","2","AS","0000","3","9",0,"AS","AS",99,,0,2,"F",1072,,40,20,9,,1,"M",3,2003,"U",,"U","N",,,"I607",235,70,,24,5,1,1,"I609",2,1,"I607",6,1,"E119",6,2,"I10",6,3,"M479",,,,,,,,,,,,,,,,,,,,,,,,,,,,,,,,,,,,,,,,,,,,,,4,"E119","I10","I607","M479",,,,,,,,,,,,,,,,,,8,,,2,4,998,9
1,1,"AS","AS000","AS",0,"AS","AS","AS000","99999","9","2","AS","0000","3","9",0,"AS","AS",99,,0,2,"M",2009,,20,2,1,20,1,"S",3,2003,"U",,"U","N",,,"G039",186,50,40,37,5,1,1,"D65",2,1,"A419",3,1,"G039",6,1,"E86",6,2,"K529",,,,,,,,,,,,,,,,,,,,,,,,,,,,,,,,,,,,,,,,,,,,,,5,"A419","D65","E86","G039","K529",,,,,,,,,,,,,,,,,8,,,2,4,998,9
1,1,"AS","AS000","AS",0,"AS","AS","AS000","99999","9","2","AS","0000","3","9",0,"ZZ","YY",99,,0,2,"F",1042,,34,14,6,,1,"M",4,2003,"U",,"U","N",,,"C169",78,22,,5,5,1,1,"I469",2,1,"C169",2,2,"C250",2,3,"C798",3,1,"C169",,,,,,,,,,,,,,,,,,,,,,,,,,,,,,,,,,,,,,,,,,,,,,4,"C169","C250","C798","I469",,,,,,,,,,,,,,,,,,8,,,2,4,998,9
1,1,"AS","AS000","AS",0,"AS","AS","AS000","99999","9","2","AS","0000","3","9",0,"ZZ","YY",99,,0,2,"F",1088,,43,23,11,,3,"W",4,2003,"U",,"U","N",,,"I500",230,67,,22,3,1,1,"R092",2,1,"J189",3,1,"I500",,,,,,,,,,,,,,,,,,,,,,,,,,,,,,,,,,,,,,,,,,,,,,,,,,,,3,"I500","J189","R092",,,,,,,,,,,,,,,,,,,8,,,2,4,998,9
1,1,"AS","AS000","AS",0,"AS","AS","AS000","99999","9","2","AS","0000","3","9",0,"ZZ","YY",99,,0,2,"F",1045,,35,15,7,,1,"W",7,2003,"U",1,"U","Y",9,9,"W19",406,118,,39,6,1,1,"S068",1,2,"S062",1,3,"S069",1,4,"W19",2,1,"S029",3,1,"T149",,,,,,,,,,,,,,,,,,,,,,,,,,,,,,,,,,,,,,,,,,,6,"S029","S062","S068","S069","T149","W19",,,,,,,,,,,,,,,,7,,,2,4,998,9
1,1,"AS","AS000","AS",0,"AS","AS","AS000","99999","9","2","AS","0000","3","9",0,"ZZ","YY",99,,0,2,"M",1057,,37,17,8,,1,"W",3,2003,"U",,"U","N",,,"E119",159,46,,16,4,1,1,"N189",2,1,"D649",3,1,"E119",4,1,"I10",,,,,,,,,,,,,,,,,,,,,,,,,,,,,,,,,,,,,,,,,,,,,,,,,4,"D649","E119","I10","N189",,,,,,,,,,,,,,,,,,8,,,2,4,998,9
1,1,"AS","AS000","AS",0,"AS","AS","AS000","99999","9","2","AS","0000","3","9",0,"ZZ","YY",99,,0,2,"M",1068,,39,19,9,,3,"M",4,2003,"U",,"U","N",,,"I64",238,70,,24,7,1,1,"I64",2,1,"I10",6,1,"E109",6,2,"I259",6,3,"E785",6,4,"N189",6,5,"M109",,,,,,,,,,,,,,,,,,,,,,,,,,,,,,,,,,,,,,,,7,"E109","E785","I10","I259","I64","M109","N189",,,,,,,,,,,,,,,8,,,2,4,998,9
1,1,"AS","AS000","AS",0,"AS","AS","AS000","99999","9","2","AS","0000","3","9",0,"ZZ","YY",99,,0,2,"F",1058,,37,17,8,,1,"M",7,2003,"U",,"U","N",,,"D699",153,111,,37,11,1,1,"N180",2,1,"D699",2,2,"K922",2,3,"D649",6,1,"J960",6,2,"J189",6,3,"J81",6,4,"I500",6,5,"I471",6,6,"I10",6,7,"K922",,,,,,,,,,,,,,,,,,,,,,,,,,,,9,"D649","D699","I120","I471","I500","J189","J81","J960","K922",,,,,,,,,,,,,8,,,2,4,998,9
1,1,"AS","AS000","AS",0,"AS","AS","AS000","99999","9","2","AS","0000","3","9",0,"AS","AS",99,,0,2,"F",5999,,1,1,1,1,1,"S",7,2003,"U",,"U","U",,,"P969",364,108,117,33,2,1,1,"P969",3,1,"P082",,,,,,,,,,,,,,,,,,,,,,,,,,,,,,,,,,,,,,,,,,,,,,,,,,,,,,,1,"P969",,,,,,,,,,,,,,,,,,,,,8,,,2,4,998,9
1,1,"AS","AS000","AS",0,"AS","AS","AS000","99999","9","2","AS","0000","3","9",0,"ZZ","YY",99,,0,2,"F",1034,,32,12,5,,3,"M",7,2003,"U",,"U","Y",,,"J81",278,89,,37,3,1,1,"J189",1,2,"J81",1,3,"R048",,,,,,,,,,,,,,,,,,,,,,,,,,,,,,,,,,,,,,,,,,,,,,,,,,,,3,"J189","J81","R048",,,,,,,,,,,,,,,,,,,8,,,2,4,998,9
1,1,"AS","AS000","AS",0,"AS","AS","AS000","99999","9","2","AS","0000","3","9",0,"AS","AS",99,,0,2,"F",1076,,41,21,10,,1,"M",2,2003,"U",,"U","N",,,"J181",257,78,,27,5,1,1,"A419",2,1,"J181",6,1,"J449",6,2,"I48",6,3,"I500",,,,,,,,,,,,,,,,,,,,,,,,,,,,,,,,,,,,,,,,,,,,,,5,"A419","I48","I500","J181","J449",,,,,,,,,,,,,,,,,8,,,2,4,998,9
2,4,"AS","AS000","AS",0,"ZZ","YY","YY000","00000","Z","Z","ZZ","0000","Z","Z",0,"ZZ","YY",99,,0,3,"F",1064,,38,18,8,,3,"U",3,2003,"U",,"U","U",,,"I219",211,59,,21,2,1,1,"I219",2,1,"I10",,,,,,,,,,,,,,,,,,,,,,,,,,,,,,,,,,,,,,,,,,,,,,,,,,,,,,,2,"I10","I219",,,,,,,,,,,,,,,,,,,,8,,,2,4,998,9
1,1,"AS","AS000","AS",0,"AS","AS","AS000","99999","9","2","AS","0000","3","9",0,"ZZ","YY",99,,0,3,"M",1029,,31,11,5,,3,"M",5,2003,"U",,"U","Y",,,"R99",379,110,,36,1,1,1,"R99",,,,,,,,,,,,,,,,,,,,,,,,,,,,,,,,,,,,,,,,,,,,,,,,,,,,,,,,,,1,"R99",,,,,,,,,,,,,,,,,,,,,8,,,2,4,998,9
1,1,"AS","AS000","AS",0,"AS","AS","AS000","99999","9","2","AS","0000","3","9",0,"AS","AS",99,,0,3,"M",1080,,42,22,10,,1,"M",6,2003,"U",,"U","U",,,"J449",267,86,,28,3,1,1,"J449",2,1,"J189",6,1,"I48",,,,,,,,,,,,,,,,,,,,,,,,,,,,,,,,,,,,,,,,,,,,,,,,,,,,3,"I48","J189","J449",,,,,,,,,,,,,,,,,,,8,,,2,4,998,9
1,1,"AS","AS000","AS",0,"AS","AS","AS000","99999","9","2","AS","0000","3","9",0,"AS","AS",99,,0,3,"M",1083,,42,22,10,,1,"M",3,2003,"U",,"U","N",9,9,"X59",423,123,,39,4,1,1,"I269",2,1,"S720",6,1,"R54",6,2,"X59",,,,,,,,,,,,,,,,,,,,,,,,,,,,,,,,,,,,,,,,,,,,,,,,,4,"I269","R54","S720","X59",,,,,,,,,,,,,,,,,,8,,,2,4,998,9
1,1,"AS","AS000","AS",0,"AS","AS","AS000","99999","9","2","AS","0000","3","9",0,"ZZ","YY",99,,0,3,"F",1054,,36,16,7,,1,"M",3,2003,"U",,"U","N",,,"E119",159,46,,16,4,1,1,"A419",2,1,"J189",3,1,"L089",4,1,"E119",,,,,,,,,,,,,,,,,,,,,,,,,,,,,,,,,,,,,,,,,,,,,,,,,4,"A419","E119","J189","L089",,,,,,,,,,,,,,,,,,8,,,2,4,998,9
1,1,"AS","AS000","AS",0,"AS","AS","AS000","99999","9","2","AS","0000","3","9",0,"AS","AS",99,,0,3,"M",1054,,36,16,7,,1,"W",3,2003,"U",,"U","N",,,"K550",293,111,,37,6,1,1,"A419",1,2,"R571",2,1,"K659",3,1,"K550",6,1,"C786",6,2,"C859",,,,,,,,,,,,,,,,,,,,,,,,,,,,,,,,,,,,,,,,,,,6,"A419","C786","C859","K550","K659","R571",,,,,,,,,,,,,,,,8,,,2,4,998,9
1,1,"AS","AS000","AS",0,"AS","AS","AS000","99999","9","2","AS","0000","3","9",0,"ZZ","YY",99,,0,3,"M",1061,,38,18,8,,1,"S",4,2003,"U",,"U","N",,,"I739",243,74,,26,2,1,1,"I219",2,1,"I739",,,,,,,,,,,,,,,,,,,,,,,,,,,,,,,,,,,,,,,,,,,,,,,,,,,,,,,2,"I219","I739",,,,,,,,,,,,,,,,,,,,8,,,2,4,998,9
1,1,"AS","AS000","AS",0,"AS","AS","AS000","99999","9","2","AS","0000","3","9",0,"AS","AS",99,,0,3,"F",1074,,40,20,9,,3,"W",5,2003,"U",,"U","N",,,"I219",211,59,,21,3,1,1,"I219",2,1,"I48",3,1,"I10",,,,,,,,,,,,,,,,,,,,,,,,,,,,,,,,,,,,,,,,,,,,,,,,,,,,3,"I10","I219","I48",,,,,,,,,,,,,,,,,,,8,,,2,4,998,9
1,1,"AS","AS000","AS",0,"AS","AS","AS000","99999","9","2","AS","0000","3","9",0,"AS","AS",99,,0,3,"F",1005,,27,7,3,,3,"S",7,2003,"U",,"U","N",,,"D649",152,45,,37,6,1,1,"E86",1,2,"R571",2,1,"A419",2,2,"R579",3,1,"D649",6,1,"A419",,,,,,,,,,,,,,,,,,,,,,,,,,,,,,,,,,,,,,,,,,,5,"A419","D649","E86","R571","R579",,,,,,,,,,,,,,,,,8,,,2,4,998,9
1,1,"AS","AS000","AS",0,"AS","AS","AS000","99999","9","2","AS","0000","3","9",0,"AS","AS",99,,0,3,"M",1065,,39,19,9,,1,"W",2,2003,"U",,"U","N",,,"J189",257,78,,27,3,1,1,"J189",2,1,"R090",6,1,"E149",,,,,,,,,,,,,,,,,,,,,,,,,,,,,,,,,,,,,,,,,,,,,,,,,,,,3,"E149","J189","R090",,,,,,,,,,,,,,,,,,,8,,,2,4,998,9
1,1,"AS","AS000","AS",0,"AS","AS","AS000","99999","9","2","AS","0000","3","9",0,"AS","AS",99,,0,3,"F",1061,,38,18,8,,1,"M",7,2003,"U",,"U","N",,,"N180",327,100,,31,3,1,1,"I469",2,1,"K922",3,1,"N180",,,,,,,,,,,,,,,,,,,,,,,,,,,,,,,,,,,,,,,,,,,,,,,,,,,,3,"I469","K922","N180",,,,,,,,,,,,,,,,,,,8,,,2,4,998,9
1,1,"AS","AS000","AS",0,"AS","AS","AS000","99999","9","2","AS","0000","3","9",0,"ZZ","YY",99,,0,3,"M",1045,,35,15,7,,1,"M",2,2003,"U",,"U","N",,,"I219",211,59,,21,3,1,1,"I219",2,1,"I48",3,1,"I500",,,,,,,,,,,,,,,,,,,,,,,,,,,,,,,,,,,,,,,,,,,,,,,,,,,,3,"I219","I48","I500",,,,,,,,,,,,,,,,,,,8,,,2,4,998,9
1,1,"AS","AS000","AS",0,"AS","AS","AS000","99999","9","2","AS","0000","3","9",0,"AS","AS",99,,0,3,"M",1045,,35,15,7,,1,"M",3,2003,"U",,"U","N",,,"I059",201,55,,22,5,1,1,"J81",2,1,"T983",3,1,"Y883",3,2,"I059",6,1,"J189",,,,,,,,,,,,,,,,,,,,,,,,,,,,,,,,,,,,,,,,,,,,,,5,"I059","J189","J81","T983","Y883",,,,,,,,,,,,,,,,,8,,,2,4,998,9
1,1,"AS","AS000","AS",0,"AS","AS","AS000","99999","9","2","AS","0000","3","9",0,"AS","AS",99,,0,3,"F",1079,,41,21,10,,3,"W",6,2003,"U",,"U","N",,,"E149",159,46,,16,5,1,1,"I64",2,1,"E149",3,1,"I500",6,1,"N19",6,2,"I10",,,,,,,,,,,,,,,,,,,,,,,,,,,,,,,,,,,,,,,,,,,,,,5,"E149","I10","I500","I64","N19",,,,,,,,,,,,,,,,,8,,,2,4,998,9
1,1,"AS","AS000","AS",0,"AS","AS","AS000","99999","9","2","AS","0000","3","9",0,"ZZ","YY",99,,0,3,"M",1057,,37,17,8,,1,"M",7,2003,"U",,"U","N",,,"C169",78,22,,5,2,1,1,"C169",2,1,"C80",,,,,,,,,,,,,,,,,,,,,,,,,,,,,,,,,,,,,,,,,,,,,,,,,,,,,,,1,"C169",,,,,,,,,,,,,,,,,,,,,8,,,2,4,998,9
1,1,"AS","AS000","AS",0,"AS","AS","AS000","99999","9","2","AS","0000","3","9",0,"AS","AS",99,,0,3,"F",1044,,34,14,6,,3,"M",2,2003,"U",,"U","N",,,"I219",211,59,,21,4,1,1,"I219",2,1,"I10",3,1,"I500",6,1,"E668",,,,,,,,,,,,,,,,,,,,,,,,,,,,,,,,,,,,,,,,,,,,,,,,,4,"E668","I10","I219","I500",,,,,,,,,,,,,,,,,,8,,,2,4,998,9
1,1,"AS","AS000","AS",0,"AS","AS","AS000","99999","9","2","AS","0000","3","9",0,"ZZ","YY",99,,0,3,"M",1065,,39,19,9,,1,"M",6,2003,"U",,"U","N",,,"C259",88,25,,7,5,1,1,"D649",1,2,"E86",2,1,"C259",3,1,"N189",6,1,"E149",,,,,,,,,,,,,,,,,,,,,,,,,,,,,,,,,,,,,,,,,,,,,,5,"C259","D649","E149","E86","N189",,,,,,,,,,,,,,,,,8,,,2,4,998,9
1,1,"AS","AS000","AS",0,"AS","AS","AS000","99999","9","2","AS","0000","3","9",0,"ZZ","YY",99,,0,4,"F",1021,,30,10,4,,3,"S",3,2003,"N",1,"U","Y",9,,"V892",397,114,,38,2,1,1,"S079",2,1,"V892",,,,,,,,,,,,,,,,,,,,,,,,,,,,,,,,,,,,,,,,,,,,,,,,,,,,,,,2,"S079","V892",,,,,,,,,,,,,,,,,,,,8,,,2,4,998,9
1,1,"AS","AS000","AS",0,"AS","AS","AS000","99999","9","2","AS","0000","3","9",0,"AS","AS",99,,0,4,"F",1028,,31,11,5,,3,"S",3,2003,"N",1,"U","Y",9,,"V892",397,114,,38,2,1,1,"T07",1,2,"V892",,,,,,,,,,,,,,,,,,,,,,,,,,,,,,,,,,,,,,,,,,,,,,,,,,,,,,,2,"T07","V892",,,,,,,,,,,,,,,,,,,,8,,,2,4,998,9
1,1,"AS","AS000","AS",0,"AS","AS","AS000","99999","9","2","AS","0000","3","9",0,"AS","AS",99,,0,4,"F",1013,,28,8,3,,1,"S",6,2003,"U",,"U","N",,,"I099",204,55,,22,5,1,1,"I639",1,2,"I64",2,1,"I330",3,1,"I500",6,1,"I099",,,,,,,,,,,,,,,,,,,,,,,,,,,,,,,,,,,,,,,,,,,,,,4,"I099","I330","I500","I639",,,,,,,,,,,,,,,,,,8,,,2,4,998,9
1,1,"AS","AS000","AS",0,"AS","AS","AS000","99999","9","2","AS","0000","3","9",0,"AS","AS",99,,0,4,"M",1077,,41,21,10,,3,"M",6,2003,"U",,"U","N",,,"J47",269,86,,28,1,1,1,"J47",,,,,,,,,,,,,,,,,,,,,,,,,,,,,,,,,,,,,,,,,,,,,,,,,,,,,,,,,,1,"J47",,,,,,,,,,,,,,,,,,,,,8,,,2,4,998,9
1,1,"AS","AS000","AS",0,"AS","AS","AS000","99999","9","2","AS","0000","3","9",0,"AS","AS",99,,0,4,"M",2003,,14,2,1,14,1,"S",7,2003,"U",,"U","N",,,"J181",257,78,57,27,6,1,1,"N19",2,1,"A419",3,1,"J181",3,2,"J90",6,1,"E86",6,2,"K529",,,,,,,,,,,,,,,,,,,,,,,,,,,,,,,,,,,,,,,,,,,6,"A419","E86","J181","J90","K529","N19",,,,,,,,,,,,,,,,8,,,2,4,998,9
1,1,"AS","AS000","AS",0,"AS","AS","AS000","99999","9","2","AS","0000","3","9",0,"AS","AS",99,,0,4,"M",1003,,25,5,2,,1,"S",1,2003,"U",,"U","N",,,"K750",301,111,,37,5,1,1,"A419",2,1,"K750",3,1,"K750",6,1,"D649",6,2,"E880",,,,,,,,,,,,,,,,,,,,,,,,,,,,,,,,,,,,,,,,,,,,,,4,"A419","D649","E880","K750",,,,,,,,,,,,,,,,,,8,,,2,4,998,9
1,1,"AS","AS000","AS",0,"AS","AS","AS000","99999","9","2","AS","0000","3","9",0,"AS","AS",99,,0,4,"M",1065,,39,19,9,,1,"M",3,2003,"U",,"U","N",,,"C169",78,22,,5,1,1,1,"C169",,,,,,,,,,,,,,,,,,,,,,,,,,,,,,,,,,,,,,,,,,,,,,,,,,,,,,,,,,1,"C169",,,,,,,,,,,,,,,,,,,,,8,,,2,4,998,9
1,1,"AS","AS000","AS",0,"AS","AS","AS000","99999","9","2","AS","0000","3","9",0,"AS","AS",99,,0,4,"M",1070,,40,20,9,,1,"S",5,2003,"U",,"U","N",,,"I694",239,70,,24,6,1,1,"J969",2,1,"J841",3,1,"I694",6,1,"I10",6,2,"E149",6,3,"E46",,,,,,,,,,,,,,,,,,,,,,,,,,,,,,,,,,,,,,,,,,,6,"E149","E46","I10","I694","J841","J969",,,,,,,,,,,,,,,,8,,,2,4,998,9
1,1,"AS","AS000","AS",0,"AS","AS","AS000","99999","9","2","AS","0000","3","9",0,"AS","AS",99,,0,4,"M",1052,,36,16,7,,1,"M",6,2003,"U",,"U","N",,,"N189",327,100,,31,9,1,1,"I500",2,1,"I219",3,1,"T828",6,1,"T827",6,2,"Y848",6,3,"N179",6,4,"N189",6,5,"E880",6,6,"K768",,,,,,,,,,,,,,,,,,,,,,,,,,,,,,,,,,9,"E880","I219","I500","K768","N179","N189","T827","T828","Y848",,,,,,,,,,,,,8,,,2,4,998,9
1,1,"AS","AS000","AS",0,"AS","AS","AS000","99999","9","2","AS","0000","3","9",0,"AS","AS",99,,0,4,"M",1087,,43,23,11,,1,"W",6,2003,"U",,"U","N",,,"C61",113,33,,11,6,1,1,"J189",1,2,"J90",2,1,"C61",6,1,"I10",6,2,"I500",6,3,"J449",,,,,,,,,,,,,,,,,,,,,,,,,,,,,,,,,,,,,,,,,,,6,"C61","I10","I500","J189","J449","J90",,,,,,,,,,,,,,,,8,,,2,4,998,9
1,1,"AS","AS000","AS",0,"AS","AS","AS000","99999","9","2","AS","0000","3","9",0,"ZZ","YY",99,,0,4,"F",1082,,42,22,10,,1,"S",7,2003,"U",,"U","N",,,"A419",23,10,,37,3,1,1,"A419",2,1,"L89",3,1,"A419",,,,,,,,,,,,,,,,,,,,,,,,,,,,,,,,,,,,,,,,,,,,,,,,,,,,2,"A419","L89",,,,,,,,,,,,,,,,,,,,8,,,2,4,998,9
1,1,"AS","AS000","AS",0,"AS","AS","AS000","99999","9","2","AS","0000","3","9",0,"AS","AS",99,,0,4,"M",4008,,9,1,1,9,1,"S",7,2003,"U",,"U","N",,,"P77",364,108,115,33,3,1,1,"P77",2,1,"P072",6,1,"P209",,,,,,,,,,,,,,,,,,,,,,,,,,,,,,,,,,,,,,,,,,,,,,,,,,,,2,"P209","P77",,,,,,,,,,,,,,,,,,,,8,,,2,4,998,9
1,1,"AS","AS000","AS",0,"AS","AS","AS000","99999","9","2","AS","0000","3","9",0,"AS","AS",99,,0,4,"F",1068,,39,19,9,,1,"M",7,2003,"U",,"U","N",,,"I619",236,70,,24,4,1,1,"I619",2,1,"I10",6,1,"E785",6,2,"J449",,,,,,,,,,,,,,,,,,,,,,,,,,,,,,,,,,,,,,,,,,,,,,,,,4,"E785","I10","I619","J449",,,,,,,,,,,,,,,,,,8,,,2,4,998,9
1,1,"AS","AS000","AS",0,"AS","AS","AS000","99999","9","2","AS","0000","3","9",0,"AS","AS",99,,0,4,"F",1073,,40,20,9,,1,"W",1,2003,"U",,"U","N",,,"C349",93,27,,8,1,1,1,"C349",,,,,,,,,,,,,,,,,,,,,,,,,,,,,,,,,,,,,,,,,,,,,,,,,,,,,,,,,,1,"C349",,,,,,,,,,,,,,,,,,,,,8,,,2,4,998,9
1,1,"AS","AS000","AS",0,"AS","AS","AS000","99999","9","2","AS","0000","3","9",0,"ZZ","YY",99,,0,4,"M",1072,,40,20,9,,1,"M",5,2003,"U",,"U","N",,,"I500",230,67,,22,3,1,1,"J969",2,1,"J449",3,1,"I500",,,,,,,,,,,,,,,,,,,,,,,,,,,,,,,,,,,,,,,,,,,,,,,,,,,,3,"I500","J449","J969",,,,,,,,,,,,,,,,,,,8,,,2,4,998,9
1,1,"AS","AS000","AS",0,"AS","AS","AS000","99999","9","2","AS","0000","3","9",0,"AS","AS",99,,0,4,"M",1063,,38,18,8,,3,"M",6,2003,"U",,"U","N",,,"I219",211,59,,21,4,1,1,"I219",2,1,"J449",3,1,"I500",6,1,"D45",,,,,,,,,,,,,,,,,,,,,,,,,,,,,,,,,,,,,,,,,,,,,,,,,4,"D45","I219","I500","J449",,,,,,,,,,,,,,,,,,8,,,2,4,998,9