"rectype","restatus","stateoc","countyoc","region","divstoc","exstatoc","staters","countyrs","cityrs","popsize","metro","regnres","divstres","exstares","pmsares","popsizoc","popsizrs","popmsa","educ","educr","monthdth","sex","race","racer3","racer2","age","ager52","ager27","ager12","ager22","placdth","marstat","statbth","hispanic","hspanicr","weekday","industry","occup","ucr52","fipscity","year","fipssto","fipsctyo","fipsstr","fipsctyr","fipspmsa","fipscmsa","injwork","raceimp","ageflag","accident","ucod","ucr282","ucr72","ucr61","ucr34","eanum","econdp_1","econds_1","enicon_1","enifla_1","econdp_2","econds_2","enicon_2","enifla_2","econdp_3","econds_3","enicon_3","enifla_3","econdp_4","econds_4","enicon_4","enifla_4","econdp_5","econds_5","enicon_5","enifla_5","econdp_6","econds_6","enicon_6","enifla_6","econdp_7","econds_7","enicon_7","enifla_7","econdp_8","econds_8","enicon_8","enifla_8","econdp_9","econds_9","enicon_9","enifla_9","econdp_10","econds_10","enicon_10","enifla_10","econdp_11","econds_11","enicon_11","enifla_11","econdp_12","econds_12","enicon_12","enifla_12","econdp_13","econds_13","enicon_13","enifla_13","econdp_14","econds_14","enicon_14","enifla_14","econdp_15","econds_15","enicon_15","enifla_15","econdp_16","econds_16","enicon_16","enifla_16","econdp_17","econds_17","enicon_17","enifla_17","econdp_18","econds_18","enicon_18","enifla_18","econdp_19","econds_19","enicon_19","enifla_19","econdp_20","econds_20","enicon_20","enifla_20","ranum","record_1","rnifla_1","record_2","rnifla_2","record_3","rnifla_3","record_4","rnifla_4","record_5","rnifla_5","record_6","rnifla_6","record_7","rnifla_7","record_8","rnifla_8","record_9","rnifla_9","record_10","rnifla_10","record_11","rnifla_11","record_12","rnifla_12","record_13","rnifla_13","record_14","rnifla_14","record_15","rnifla_15","record_16","rnifla_16","record_17","rnifla_17","record_18","rnifla_18","record_19","rnifla_19","record_20","rnifla_20"
1,1,"52","52065",0,0,"53","52","52065","999","9","1",0,0,"53","006",2,"2","1",12,3,1,2,1,1,1,85,43,23,11,,1,3,52,99,9,4,990,999,390,"99999",1997,"72","72127","72","72127","7440","87",2,,,,"4140",17700,390,680,170,4,1,"1","4275","0",2,"1","4140","0",3,"1","4280","0",4,"1","3310","0",,,,,,,,,,,,,,,,,,,,,,,,,,,,,,,,,,,,,,,,,,,,,,,,,,,,,,,,,,,,,,,,,4,"3310",0,"4140",0,"4275",0,"4280",0,,,,,,,,,,,,,,,,,,,,,,,,,,,,,,,,
1,1,"52","52065",0,0,"53","52","52065","999","9","1",0,0,"53","006",2,"2","1",17,5,1,1,1,1,1,64,38,18,8,,1,2,52,99,9,4,990,999,450,"99999",1997,"72","72127","72","72127","7440","87",2,,,,"496",22300,580,200,240,3,1,"1","496","0",2,"1","0389","0",3,"1","2500","0",,,,,,,,,,,,,,,,,,,,,,,,,,,,,,,,,,,,,,,,,,,,,,,,,,,,,,,,,,,,,,,,,,,,,3,"0389",0,"2500",0,"496",0,,,,,,,,,,,,,,,,,,,,,,,,,,,,,,,,,,
2,2,"52","52065",0,0,"53","52","52016","999","9","1",0,0,"53","006",2,"3","1",12,3,1,1,1,1,1,82,42,22,10,,1,4,52,99,9,4,990,999,320,"99999",1997,"72","72127","72","72031","7440","87",2,,,,"2507",12200,260,680,120,4,1,"1","4275","0",2,"1","485","0",3,"1","2500","0",4,"1","7070","0",,,,,,,,,,,,,,,,,,,,,,,,,,,,,,,,,,,,,,,,,,,,,,,,,,,,,,,,,,,,,,,,,3,"2507",0,"4275",0,"485",0,,,,,,,,,,,,,,,,,,,,,,,,,,,,,,,,,,
1,1,"52","52065",0,0,"53","52","52065","999","9","1",0,0,"53","006",2,"2","1",16,5,1,1,1,1,1,70,40,20,9,,1,3,52,99,9,4,990,999,560,"99999",1997,"72","72127","72","72127","7440","87",2,,,,"4599",20300,780,680,320,2,1,"1","4599","0",2,"1","7991","0",,,,,,,,,,,,,,,,,,,,,,,,,,,,,,,,,,,,,,,,,,,,,,,,,,,,,,,,,,,,,,,,,,,,,,,,,2,"4599",0,"7991",0,,,,,,,,,,,,,,,,,,,,,,,,,,,,,,,,,,,,
1,1,"52","52065",0,0,"53","52","52065","999","9","1",0,0,"53","006",2,"2","1",14,4,1,2,1,1,1,94,44,24,11,,1,3,52,99,9,5,990,999,20,"99999",1997,"72","72127","72","72127","7440","87",2,,,,"0389",1900,90,40,30,4,1,"1","7991","0",2,"1","485","0",3,"1","436","0",4,"1","0389","0",,,,,,,,,,,,,,,,,,,,,,,,,,,,,,,,,,,,,,,,,,,,,,,,,,,,,,,,,,,,,,,,,4,"0389",0,"436",0,"485",0,"7991",0,,,,,,,,,,,,,,,,,,,,,,,,,,,,,,,,
1,1,"52","52065",0,0,"53","52","52065","999","9","1",0,0,"53","006",2,"2","1",12,3,1,2,1,1,1,79,41,21,10,,6,2,52,99,9,5,990,999,560,"99999",1997,"72","72127","72","72127","7440","87",2,,,,"5119",22600,780,200,320,4,1,"1","4275","0",2,"1","7991","0",3,"1","486","0",4,"1","5119","0",,,,,,,,,,,,,,,,,,,,,,,,,,,,,,,,,,,,,,,,,,,,,,,,,,,,,,,,,,,,,,,,,4,"4275",0,"486",0,"5119",0,"7991",0,,,,,,,,,,,,,,,,,,,,,,,,,,,,,,,,
2,2,"52","52065",0,0,"53","52","52999","999","9","1",0,0,"53","006",2,"9","1",12,3,1,1,1,1,1,71,40,20,9,,1,2,52,99,9,4,990,999,560,"99999",1997,"72","72127","72","72999","7440","87",2,,,,"5939",25600,780,680,320,3,1,"1","0389","0",2,"1","485","0",3,"1","5939","0",,,,,,,,,,,,,,,,,,,,,,,,,,,,,,,,,,,,,,,,,,,,,,,,,,,,,,,,,,,,,,,,,,,,,3,"0389",0,"485",0,"5939",0,,,,,,,,,,,,,,,,,,,,,,,,,,,,,,,,,,
1,1,"52","52065",0,0,"53","52","52065","999","9","1",0,0,"53","006",2,"2","1",0,1,1,2,1,1,1,89,43,23,11,,5,3,52,99,9,7,990,999,560,"99999",1997,"72","72127","72","72127","7440","87",2,,,,"280",13500,280,120,320,4,1,"1","4275","0",2,"1","410","0",3,"1","280","0",6,"1","5693","0",,,,,,,,,,,,,,,,,,,,,,,,,,,,,,,,,,,,,,,,,,,,,,,,,,,,,,,,,,,,,,,,,4,"280",0,"410",0,"4275",0,"5693",0,,,,,,,,,,,,,,,,,,,,,,,,,,,,,,,,
2,4,"52","52065",0,0,"53","59","59ZZZ","ZZZ","Z","Z",0,0,"60","ZZZ",2,"Z","Z",15,4,1,1,1,1,1,50,36,16,7,,1,2,59,99,9,6,990,999,490,"00000",1997,"72","72127","00","00000","0000","00",2,,,,"586",25300,670,680,270,4,1,"1","4275","0",2,"1","0389","0",3,"1","5184","0",4,"1","586","0",,,,,,,,,,,,,,,,,,,,,,,,,,,,,,,,,,,,,,,,,,,,,,,,,,,,,,,,,,,,,,,,,4,"0389",0,"4275",0,"5184",0,"586",0,,,,,,,,,,,,,,,,,,,,,,,,,,,,,,,,
1,1,"52","52065",0,0,"53","52","52065","999","9","1",0,0,"53","006",2,"2","1",12,3,1,2,1,1,1,82,42,22,10,,1,2,59,99,9,1,990,999,400,"99999",1997,"72","72127","72","72127","7440","87",2,,,,"4280",18600,410,680,180,3,1,"1","486","0",2,"1","0389","0",3,"1","4280","0",,,,,,,,,,,,,,,,,,,,,,,,,,,,,,,,,,,,,,,,,,,,,,,,,,,,,,,,,,,,,,,,,,,,,3,"0389",0,"4280",0,"486",0,,,,,,,,,,,,,,,,,,,,,,,,,,,,,,,,,,
1,1,"52","52065",0,0,"53","52","52065","999","9","1",0,0,"53","006",2,"2","1",12,3,1,1,1,1,1,79,41,21,10,,6,2,52,99,9,7,990,999,220,"99999",1997,"72","72127","72","72127","7440","87",2,,,,"185",8700,200,80,80,3,1,"1","4275","0",2,"1","1970","0",3,"1","185","0",,,,,,,,,,,,,,,,,,,,,,,,,,,,,,,,,,,,,,,,,,,,,,,,,,,,,,,,,,,,,,,,,,,,,3,"185",0,"1970",0,"4275",0,,,,,,,,,,,,,,,,,,,,,,,,,,,,,,,,,,
1,1,"52","52065",0,0,"53","52","52065","999","9","1",0,0,"53","006",2,"2","1",12,3,1,2,1,1,1,58,37,17,8,,6,3,59,99,9,2,990,999,70,"99999",1997,"72","72127","72","72127","7440","87",2,,,,"1539",6200,170,80,50,3,1,"1","1539","0",1,"2","1988","0",1,"3","4590","0",,,,,,,,,,,,,,,,,,,,,,,,,,,,,,,,,,,,,,,,,,,,,,,,,,,,,,,,,,,,,,,,,,,,,3,"1539",0,"1988",0,"4590",0,,,,,,,,,,,,,,,,,,,,,,,,,,,,,,,,,,
1,1,"52","52065",0,0,"53","52","52065","999","9","1",0,0,"53","006",2,"2","1",6,1,1,1,1,1,1,73,40,20,9,,2,2,52,99,9,7,990,999,450,"99999",1997,"72","72127","72","72127","7440","87",2,,,,"496",22300,580,200,240,3,1,"1","7855","0",2,"1","485","0",3,"1","496","0",,,,,,,,,,,,,,,,,,,,,,,,,,,,,,,,,,,,,,,,,,,,,,,,,,,,,,,,,,,,,,,,,,,,,3,"485",0,"496",0,"7855",0,,,,,,,,,,,,,,,,,,,,,,,,,,,,,,,,,,
1,1,"52","52065",0,0,"53","52","52065","999","9","1",0,0,"53","006",2,"2","1",12,3,1,1,1,1,1,74,40,20,9,,5,4,52,99,9,1,990,999,70,"99999",1997,"72","72127","72","72127","7440","87",2,,,,"1539",6200,170,80,50,5,1,"1","4275","0",2,"1","5184","0",3,"1","1539","0",4,"1","2500","0",6,"1","1990","0",,,,,,,,,,,,,,,,,,,,,,,,,,,,,,,,,,,,,,,,,,,,,,,,,,,,,,,,,,,,,5,"1539",0,"1990",0,"2500",0,"4275",0,"5184",0,,,,,,,,,,,,,,,,,,,,,,,,,,,,,,
1,1,"52","52065",0,0,"53","52","52065","999","9","1",0,0,"53","006",2,"2","1",17,5,1,2,1,1,1,66,39,19,9,,1,1,52,99,9,7,990,999,560,"99999",1997,"72","72127","72","72127","7440","87",2,,,,"2898",14000,780,120,320,2,1,"1","486","0",2,"1","2898","0",,,,,,,,,,,,,,,,,,,,,,,,,,,,,,,,,,,,,,,,,,,,,,,,,,,,,,,,,,,,,,,,,,,,,,,,,2,"2898",0,"486",0,,,,,,,,,,,,,,,,,,,,,,,,,,,,,,,,,,,,
1,1,"52","52065",0,0,"53","52","52065","999","9","1",0,0,"53","006",2,"2","1",12,3,1,1,1,1,1,72,40,20,9,,6,2,33,99,9,7,990,999,350,"99999",1997,"72","72127","72","72127","7440","87",2,,,,"4020",17000,330,680,160,2,1,"1","4280","0",2,"1","4010","0",,,,,,,,,,,,,,,,,,,,,,,,,,,,,,,,,,,,,,,,,,,,,,,,,,,,,,,,,,,,,,,,,,,,,,,,,1,"4020",0,,,,,,,,,,,,,,,,,,,,,,,,,,,,,,,,,,,,,,
1,1,"52","52065",0,0,"53","52","52065","999","9","1",0,0,"53","006",2,"2","1",5,1,1,2,1,1,1,77,41,21,10,,5,1,52,99,9,2,990,999,320,"99999",1997,"72","72127","72","72127","7440","87",2,,,,"2500",12200,260,680,120,4,1,"1","4275","0",2,"1","2500","0",3,"1","4249","0",4,"1","797","0",,,,,,,,,,,,,,,,,,,,,,,,,,,,,,,,,,,,,,,,,,,,,,,,,,,,,,,,,,,,,,,,,4,"2500",0,"4249",0,"4275",0,"797",0,,,,,,,,,,,,,,,,,,,,,,,,,,,,,,,,
2,2,"52","52065",0,0,"53","52","52999","999","9","1",0,0,"53","006",2,"9","1",16,5,1,1,1,1,1,69,39,19,9,,5,2,52,99,9,4,990,999,390,"99999",1997,"72","72127","72","72999","7440","87",2,,,,"4149",17700,390,680,170,7,1,"1","4275","0",1,"2","4149","0",2,"1","4019","0",3,"1","820","1",4,"1","3570","0",6,"1","7819","0",6,"2","887","0",,,,,,,,,,,,,,,,,,,,,,,,,,,,,,,,,,,,,,,,,,,,,,,,,,,,,7,"3570",0,"4019",0,"4149",0,"4275",0,"7819",0,"820",1,"887",0,,,,,,,,,,,,,,,,,,,,,,,,,,
2,2,"52","52065",0,0,"53","52","52011","999","9","1",0,0,"53","006",2,"3","1",14,4,1,1,1,1,1,78,41,21,10,,1,2,52,99,9,2,990,999,560,"99999",1997,"72","72127","72","72021","7440","87",2,,,,"7302",28500,780,680,320,2,1,"1","486","0",2,"1","7302","0",,,,,,,,,,,,,,,,,,,,,,,,,,,,,,,,,,,,,,,,,,,,,,,,,,,,,,,,,,,,,,,,,,,,,,,,,2,"486",0,"7302",0,,,,,,,,,,,,,,,,,,,,,,,,,,,,,,,,,,,,
2,2,"52","52065",0,0,"53","52","52016","999","9","1",0,0,"53","006",2,"3","1",4,1,1,2,1,1,1,82,42,22,10,,2,3,52,99,9,3,990,999,320,"99999",1997,"72","72127","72","72031","7440","87",2,,,,"2500",12200,260,680,120,4,1,"1","4275","0",2,"1","436","0",3,"1","4019","0",4,"1","2500","0",,,,,,,,,,,,,,,,,,,,,,,,,,,,,,,,,,,,,,,,,,,,,,,,,,,,,,,,,,,,,,,,,4,"2500",0,"4019",0,"4275",0,"436",0,,,,,,,,,,,,,,,,,,,,,,,,,,,,,,,,
2,2,"52","52065",0,0,"53","52","52999","999","9","1",0,0,"53","006",2,"9","1",3,1,1,2,2,3,2,75,41,21,10,,5,2,52,99,9,3,990,999,400,"99999",1997,"72","72127","72","72999","7440","87",2,,,,"4280",18600,410,680,180,5,1,"1","7991","0",2,"1","797","0",3,"1","0389","0",4,"1","4280","0",6,"1","2500","0",,,,,,,,,,,,,,,,,,,,,,,,,,,,,,,,,,,,,,,,,,,,,,,,,,,,,,,,,,,,,5,"0389",0,"2500",0,"4280",0,"797",0,"7991",0,,,,,,,,,,,,,,,,,,,,,,,,,,,,,,
1,1,"52","52065",0,0,"53","52","52065","999","9","1",0,0,"53","006",2,"2","1",16,5,1,1,1,1,1,62,38,18,8,,1,2,52,99,9,3,990,999,380,"99999",1997,"72","72127","72","72127","7440","87",2,,,,"410",17400,360,680,170,3,1,"1","0389","0",2,"1","486","0",3,"1","410","0",,,,,,,,,,,,,,,,,,,,,,,,,,,,,,,,,,,,,,,,,,,,,,,,,,,,,,,,,,,,,,,,,,,,,3,"0389",0,"410",0,"486",0,,,,,,,,,,,,,,,,,,,,,,,,,,,,,,,,,,
1,1,"52","52065",0,0,"53","52","52065","999","9","1",0,0,"53","006",2,"2","1",16,5,1,2,1,1,1,72,40,20,9,,6,2,52,99,9,2,990,999,380,"99999",1997,"72","72127","72","72127","7440","87",2,,,,"410",17400,360,680,170,7,1,"1","410","0",2,"1","4149","0",3,"1","4019","0",4,"1","4280","0",6,"1","797","0",6,"2","4939","0",6,"3","2500","0",,,,,,,,,,,,,,,,,,,,,,,,,,,,,,,,,,,,,,,,,,,,,,,,,,,,,7,"2500",0,"4019",0,"410",0,"4149",0,"4280",0,"4939",0,"797",0,,,,,,,,,,,,,,,,,,,,,,,,,,
1,1,"52","52065",0,0,"53","52","52065","999","9","1",0,0,"53","006",2,"2","1",7,1,1,1,1,1,1,48,35,15,7,,1,4,52,99,9,3,990,999,560,"99999",1997,"72","72127","72","72127","7440","87",2,,,,"0429",2800,140,70,30,3,1,"1","0429","0",2,"1","0310","0",3,"1","0429","0",,,,,,,,,,,,,,,,,,,,,,,,,,,,,,,,,,,,,,,,,,,,,,,,,,,,,,,,,,,,,,,,,,,,,2,"0310",0,"0429",0,,,,,,,,,,,,,,,,,,,,,,,,,,,,,,,,,,,,
2,2,"52","52065",0,0,"53","52","52999","999","9","1",0,0,"53","006",2,"9","1",12,3,1,1,1,1,1,68,39,19,9,,1,2,52,99,9,3,990,999,560,"99999",1997,"72","72127","72","72999","7440","87",2,,,,"5762",24600,780,230,320,2,1,"1","5762","0",2,"1","2399","0",,,,,,,,,,,,,,,,,,,,,,,,,,,,,,,,,,,,,,,,,,,,,,,,,,,,,,,,,,,,,,,,,,,,,,,,,2,"2399",0,"5762",0,,,,,,,,,,,,,,,,,,,,,,,,,,,,,,,,,,,,
1,1,"52","52065",0,0,"53","52","52065","999","9","1",0,0,"53","006",2,"2","1",16,5,1,1,1,1,1,81,42,22,10,,1,2,52,99,9,5,990,999,390,"99999",1997,"72","72127","72","72127","7440","87",2,,,,"4140",17700,390,680,170,3,1,"1","4275","0",2,"1","4148","0",3,"1","4140","0",,,,,,,,,,,,,,,,,,,,,,,,,,,,,,,,,,,,,,,,,,,,,,,,,,,,,,,,,,,,,,,,,,,,,3,"4140",0,"4148",0,"4275",0,,,,,,,,,,,,,,,,,,,,,,,,,,,,,,,,,,
1,1,"52","52065",0,0,"53","52","52065","999","9","1",0,0,"53","006",2,"2","1",12,3,1,1,1,1,1,90,44,24,11,,6,2,52,99,9,2,990,999,560,"99999",1997,"72","72127","72","72127","7440","87",2,,,,"5070",22400,780,200,320,3,1,"1","0389","0",2,"1","5990","0",3,"1","5070","0",,,,,,,,,,,,,,,,,,,,,,,,,,,,,,,,,,,,,,,,,,,,,,,,,,,,,,,,,,,,,,,,,,,,,3,"0389",0,"5070",0,"5990",0,,,,,,,,,,,,,,,,,,,,,,,,,,,,,,,,,,
1,1,"52","52065",0,0,"53","52","52065","999","9","1",0,0,"53","006",2,"2","1",3,1,1,2,1,1,1,84,42,22,10,,5,3,52,99,9,7,990,999,400,"99999",1997,"72","72127","72","72127","7440","87",2,,,,"4280",18600,410,680,180,2,1,"1","4279","0",2,"1","4280","0",,,,,,,,,,,,,,,,,,,,,,,,,,,,,,,,,,,,,,,,,,,,,,,,,,,,,,,,,,,,,,,,,,,,,,,,,2,"4279",0,"4280",0,,,,,,,,,,,,,,,,,,,,,,,,,,,,,,,,,,,,
1,1,"52","52065",0,0,"53","52","52065","999","9","1",0,0,"53","006",2,"2","1",16,5,1,2,1,1,1,83,42,22,10,,6,1,59,99,9,2,990,999,400,"99999",1997,"72","72127","72","72127","7440","87",2,,,,"4275",18800,410,680,180,1,1,"1","4275","0",,,,,,,,,,,,,,,,,,,,,,,,,,,,,,,,,,,,,,,,,,,,,,,,,,,,,,,,,,,,,,,,,,,,,,,,,,,,,1,"4275",0,,,,,,,,,,,,,,,,,,,,,,,,,,,,,,,,,,,,,,
2,2,"52","52065",0,0,"53","52","52999","999","9","1",0,0,"53","006",2,"9","1",4,1,1,1,1,1,1,83,42,22,10,,1,3,52,99,9,4,990,999,560,"99999",1997,"72","72127","72","72999","7440","87",2,,,,"3483",15700,780,140,320,9,2,"1","4275","0",3,"1","5070","0",4,"1","3483","0",6,"1","5185","0",6,"2","0389","0",6,"3","586","0",6,"4","5789","0",6,"5","4149","0",6,"6","2500","0",,,,,,,,,,,,,,,,,,,,,,,,,,,,,,,,,,,,,,,,,,,,,9,"0389",0,"2500",0,"3483",0,"4149",0,"4275",0,"5070",0,"5185",0,"5789",0,"586",0,,,,,,,,,,,,,,,,,,,,,,
1,1,"52","52065",0,0,"53","52","52065","999","9","1",0,0,"53","006",2,"2","1",17,5,1,2,1,1,1,57,37,17,8,,1,2,52,99,9,1,990,999,420,"99999",1997,"72","72127","72","72127","7440","87",2,,,,"430",19000,470,680,200,1,1,"1","430","0",,,,,,,,,,,,,,,,,,,,,,,,,,,,,,,,,,,,,,,,,,,,,,,,,,,,,,,,,,,,,,,,,,,,,,,,,,,,,1,"430",0,,,,,,,,,,,,,,,,,,,,,,,,,,,,,,,,,,,,,,
1,1,"52","52065",0,0,"53","52","52065","999","9","1",0,0,"53","006",2,"2","1",12,3,1,1,2,3,2,91,44,24,11,,1,3,52,99,9,2,990,999,560,"99999",1997,"72","72127","72","72127","7440","87",2,,,,"6826",27800,780,680,320,4,1,"1","7991","0",2,"1","0389","0",3,"1","7302","0",4,"1","6826","0",,,,,,,,,,,,,,,,,,,,,,,,,,,,,,,,,,,,,,,,,,,,,,,,,,,,,,,,,,,,,,,,,4,"0389",0,"6826",0,"7302",0,"7991",0,,,,,,,,,,,,,,,,,,,,,,,,,,,,,,,,
1,1,"52","52065",0,0,"53","52","52065","999","9","1",0,0,"53","006",2,"2","1",3,1,1,2,1,1,1,94,44,24,11,,1,3,52,99,9,1,990,999,560,"99999",1997,"72","72127","72","72127","7440","87",2,,,,"5789",24600,780,230,320,5,1,"1","7991","0",2,"1","486","0",3,"1","4280","0",4,"1","5789","0",6,"1","2500","0",,,,,,,,,,,,,,,,,,,,,,,,,,,,,,,,,,,,,,,,,,,,,,,,,,,,,,,,,,,,,5,"2500",0,"4280",0,"486",0,"5789",0,"7991",0,,,,,,,,,,,,,,,,,,,,,,,,,,,,,,
2,2,"52","52065",0,0,"53","52","52999","999","9","1",0,0,"53","006",2,"9","1",12,3,1,1,1,1,1,69,39,19,9,,1,4,52,99,9,7,990,999,130,"99999",1997,"72","72127","72","72999","7440","87",2,,,,"1629",7300,180,80,60,1,1,"1","1629","0",,,,,,,,,,,,,,,,,,,,,,,,,,,,,,,,,,,,,,,,,,,,,,,,,,,,,,,,,,,,,,,,,,,,,,,,,,,,,1,"1629",0,,,,,,,,,,,,,,,,,,,,,,,,,,,,,,,,,,,,,,
1,1,"52","52065",0,0,"53","52","52065","999","9","1",0,0,"53","006",2,"2","1",7,1,1,2,1,1,1,91,44,24,11,,1,3,52,99,9,7,990,999,560,"99999",1997,"72","72127","72","72127","7440","87",2,,,,"2765",12800,780,680,320,3,1,"1","485","0",2,"1","0389","0",3,"1","2765","0",,,,,,,,,,,,,,,,,,,,,,,,,,,,,,,,,,,,,,,,,,,,,,,,,,,,,,,,,,,,,,,,,,,,,3,"0389",0,"2765",0,"485",0,,,,,,,,,,,,,,,,,,,,,,,,,,,,,,,,,,
1,1,"52","52065",0,0,"53","52","52065","999","9","1",0,0,"53","006",2,"2","1",12,3,1,2,1,1,1,78,41,21,10,,6,1,52,99,9,2,990,999,380,"99999",1997,"72","72127","72","72127","7440","87",2,,,,"410",17400,360,680,170,3,1,"1","410","0",2,"1","4140","0",6,"1","4019","0",,,,,,,,,,,,,,,,,,,,,,,,,,,,,,,,,,,,,,,,,,,,,,,,,,,,,,,,,,,,,,,,,,,,,3,"4019",0,"410",0,"4140",0,,,,,,,,,,,,,,,,,,,,,,,,,,,,,,,,,,
2,2,"52","52065",0,0,"53","52","52999","999","9","1",0,0,"53","006",2,"9","1",4,1,1,1,1,1,1,43,34,14,6,,1,1,52,99,9,3,990,999,560,"99999",1997,"72","72127","72","72999","7440","87",2,,,,"2793",12800,780,680,320,2,1,"1","7991","0",2,"1","2793","0",,,,,,,,,,,,,,,,,,,,,,,,,,,,,,,,,,,,,,,,,,,,,,,,,,,,,,,,,,,,,,,,,,,,,,,,,2,"2793",0,"7991",0,,,,,,,,,,,,,,,,,,,,,,,,,,,,,,,,,,,,
2,2,"52","52065",0,0,"53","52","52016","999","9","1",0,0,"53","006",2,"3","1",12,3,1,1,1,1,1,75,41,21,10,,1,2,52,99,9,3,990,999,440,"99999",1997,"72","72127","72","72031","7440","87",2,,,,"486",21400,520,180,230,1,1,"1","486","0",,,,,,,,,,,,,,,,,,,,,,,,,,,,,,,,,,,,,,,,,,,,,,,,,,,,,,,,,,,,,,,,,,,,,,,,,,,,,1,"486",0,,,,,,,,,,,,,,,,,,,,,,,,,,,,,,,,,,,,,,
1,1,"52","52065",0,0,"53","52","52065","999","9","1",0,0,"53","006",2,"2","1",4,1,1,1,1,1,1,78,41,21,10,,1,2,52,99,9,4,990,999,220,"99999",1997,"72","72127","72","72127","7440","87",2,,,,"185",8700,200,80,80,3,1,"1","7991","0",2,"1","185","0",2,"2","1985","0",,,,,,,,,,,,,,,,,,,,,,,,,,,,,,,,,,,,,,,,,,,,,,,,,,,,,,,,,,,,,,,,,,,,,3,"185",0,"1985",0,"7991",0,,,,,,,,,,,,,,,,,,,,,,,,,,,,,,,,,,
1,1,"52","52065",0,0,"53","52","52065","999","9","1",0,0,"53","006",2,"2","1",6,1,1,2,1,1,1,88,43,23,11,,1,3,52,99,9,3,990,999,560,"99999",1997,"72","72127","72","72127","7440","87",2,,,,"5939",25600,780,680,320,3,1,"1","485","0",2,"1","0389","0",3,"1","5939","0",,,,,,,,,,,,,,,,,,,,,,,,,,,,,,,,,,,,,,,,,,,,,,,,,,,,,,,,,,,,,,,,,,,,,3,"0389",0,"485",0,"5939",0,,,,,,,,,,,,,,,,,,,,,,,,,,,,,,,,,,
1,1,"52","52065",0,0,"53","52","52065","999","9","1",0,0,"53","006",2,"2","1",12,3,1,1,1,1,1,47,35,15,7,,6,2,52,99,9,4,990,999,400,"99999",1997,"72","72127","72","72127","7440","87",2,,,,"4275",18800,410,680,180,2,1,"1","4151","0",2,"1","4275","0",,,,,,,,,,,,,,,,,,,,,,,,,,,,,,,,,,,,,,,,,,,,,,,,,,,,,,,,,,,,,,,,,,,,,,,,,2,"4151",0,"4275",0,,,,,,,,,,,,,,,,,,,,,,,,,,,,,,,,,,,,
1,1,"52","52065",0,0,"53","52","52065","999","9","1",0,0,"53","006",2,"2","1",4,1,1,1,1,1,1,90,44,24,11,,1,2,52,99,9,4,990,999,20,"99999",1997,"72","72127","72","72127","7440","87",2,,,,"0389",1900,90,40,30,3,1,"1","7991","0",2,"1","5070","0",3,"1","0389","0",,,,,,,,,,,,,,,,,,,,,,,,,,,,,,,,,,,,,,,,,,,,,,,,,,,,,,,,,,,,,,,,,,,,,3,"0389",0,"5070",0,"7991",0,,,,,,,,,,,,,,,,,,,,,,,,,,,,,,,,,,
2,2,"52","52065",0,0,"53","52","52999","999","9","1",0,0,"53","006",2,"9","1",13,4,1,1,1,1,1,71,40,20,9,,1,2,52,99,9,4,990,999,560,"99999",1997,"72","72127","72","72999","7440","87",2,,,,"0030",500,140,70,30,3,1,"1","5185","0",2,"1","0389","0",3,"1","0030","0",,,,,,,,,,,,,,,,,,,,,,,,,,,,,,,,,,,,,,,,,,,,,,,,,,,,,,,,,,,,,,,,,,,,,3,"0030",0,"0389",0,"5185",0,,,,,,,,,,,,,,,,,,,,,,,,,,,,,,,,,,
1,1,"52","52065",0,0,"53","52","52065","999","9","1",0,0,"53","006",2,"2","1",6,1,1,1,1,1,1,71,40,20,9,,1,2,52,99,9,4,990,999,380,"99999",1997,"72","72127","72","72127","7440","87",2,,,,"410",17400,360,680,170,4,1,"1","4275","0",2,"1","410","0",3,"1","4019","0",6,"1","586","0",,,,,,,,,,,,,,,,,,,,,,,,,,,,,,,,,,,,,,,,,,,,,,,,,,,,,,,,,,,,,,,,,3,"4039",0,"410",0,"4275",0,,,,,,,,,,,,,,,,,,,,,,,,,,,,,,,,,,
2,2,"52","52065",0,0,"53","52","52999","999","9","1",0,0,"53","006",2,"9","1",12,3,1,1,1,1,1,49,35,15,7,,1,2,52,99,9,5,990,999,320,"99999",1997,"72","72127","72","72999","7440","87",2,,,,"2503",12200,260,680,120,5,1,"1","0389","0",2,"1","5070","0",3,"1","5939","0",4,"1","2500","0",5,"1","4292","0",,,,,,,,,,,,,,,,,,,,,,,,,,,,,,,,,,,,,,,,,,,,,,,,,,,,,,,,,,,,,4,"0389",0,"2503",0,"4292",0,"5070",0,,,,,,,,,,,,,,,,,,,,,,,,,,,,,,,,
1,1,"52","52065",0,0,"53","52","52065","999","9","1",0,0,"53","006",2,"2","1",3,1,1,2,1,1,1,74,40,20,9,,6,1,52,99,9,4,990,999,390,"99999",1997,"72","72127","72","72127","7440","87",2,,,,"4140",17700,390,680,170,4,1,"1","4275","0",2,"1","4019","0",3,"1","4140","0",4,"1","797","0",,,,,,,,,,,,,,,,,,,,,,,,,,,,,,,,,,,,,,,,,,,,,,,,,,,,,,,,,,,,,,,,,4,"4019",0,"4140",0,"4275",0,"797",0,,,,,,,,,,,,,,,,,,,,,,,,,,,,,,,,
2,2,"52","52065",0,0,"53","52","52013","999","9","1",0,0,"53","003",2,"3","1",1,1,1,1,1,1,1,48,35,15,7,,1,4,52,99,9,4,990,999,490,"99999",1997,"72","72127","72","72025","1310","87",2,,,,"586",25300,670,680,270,2,1,"1","0389","0",2,"1","586","0",,,,,,,,,,,,,,,,,,,,,,,,,,,,,,,,,,,,,,,,,,,,,,,,,,,,,,,,,,,,,,,,,,,,,,,,,2,"0389",0,"586",0,,,,,,,,,,,,,,,,,,,,,,,,,,,,,,,,,,,,
2,2,"52","52065",0,0,"53","52","52999","999","9","1",0,0,"53","006",2,"9","1",0,1,1,1,1,1,1,92,44,24,11,,5,3,52,99,9,6,990,999,320,"99999",1997,"72","72127","72","72999","7440","87",2,,,,"2500",12200,260,680,120,3,1,"1","4280","0",2,"1","4149","0",3,"1","2500","0",,,,,,,,,,,,,,,,,,,,,,,,,,,,,,,,,,,,,,,,,,,,,,,,,,,,,,,,,,,,,,,,,,,,,3,"2500",0,"4149",0,"4280",0,,,,,,,,,,,,,,,,,,,,,,,,,,,,,,,,,,
2,2,"52","52065",0,0,"53","52","52016","999","9","1",0,0,"53","006",2,"3","1",12,3,1,2,1,1,1,62,38,18,8,,2,3,52,99,9,7,990,999,310,"99999",1997,"72","72127","72","72031","7440","87",2,,,,"1599",7000,170,80,50,3,1,"1","1599","0",6,"1","5789","0",6,"2","2859","0",,,,,,,,,,,,,,,,,,,,,,,,,,,,,,,,,,,,,,,,,,,,,,,,,,,,,,,,,,,,,,,,,,,,,3,"1599",0,"2859",0,"5789",0,,,,,,,,,,,,,,,,,,,,,,,,,,,,,,,,,,
1,1,"52","52065",0,0,"53","52","52065","999","9","1",0,0,"53","006",2,"2","1",12,3,1,1,1,1,1,78,41,21,10,,6,2,52,99,9,1,990,999,350,"99999",1997,"72","72127","72","72127","7440","87",2,,,,"4029",17000,330,680,160,1,1,"1","4029","0",,,,,,,,,,,,,,,,,,,,,,,,,,,,,,,,,,,,,,,,,,,,,,,,,,,,,,,,,,,,,,,,,,,,,,,,,,,,,1,"4029",0,,,,,,,,,,,,,,,,,,,,,,,,,,,,,,,,,,,,,,
1,1,"52","52065",0,0,"53","52","52999","999","9","2",0,0,"53","000",2,"9","9",17,5,1,2,1,1,1,88,43,23,11,,1,1,52,99,9,5,990,999,300,"99999",1997,"72","72127","72","72999","0000","00",2,,,,"2041",10500,230,80,100,4,1,"1","7991","0",2,"1","485","0",3,"1","515","0",4,"1","2041","0",,,,,,,,,,,,,,,,,,,,,,,,,,,,,,,,,,,,,,,,,,,,,,,,,,,,,,,,,,,,,,,,,4,"2041",0,"485",0,"515",0,"7991",0,,,,,,,,,,,,,,,,,,,,,,,,,,,,,,,,
2,2,"52","52065",0,0,"53","52","52011","999","9","1",0,0,"53","006",2,"3","1",12,3,1,1,2,3,2,64,38,18,8,,1,4,52,99,9,4,990,999,560,"99999",1997,"72","72127","72","72021","7440","87",2,,,,"5939",25600,780,680,320,4,1,"1","7855","0",2,"1","5698","0",3,"1","7890","0",4,"1","5939","0",,,,,,,,,,,,,,,,,,,,,,,,,,,,,,,,,,,,,,,,,,,,,,,,,,,,,,,,,,,,,,,,,4,"5698",0,"5939",0,"7855",0,"7890",0,,,,,,,,,,,,,,,,,,,,,,,,,,,,,,,,
1,1,"52","52065",0,0,"53","52","52065","999","9","1",0,0,"53","006",2,"2","1",17,5,1,2,1,1,1,77,41,21,10,,1,2,52,99,9,5,990,999,390,"99999",1997,"72","72127","72","72127","7440","87",2,,,,"4149",17700,390,680,170,5,1,"1","4340","0",2,"1","4349","0",3,"1","4149","0",6,"1","485","0",6,"2","4280","0",,,,,,,,,,,,,,,,,,,,,,,,,,,,,,,,,,,,,,,,,,,,,,,,,,,,,,,,,,,,,4,"4149",0,"4280",0,"4340",0,"485",0,,,,,,,,,,,,,,,,,,,,,,,,,,,,,,,,
1,1,"52","52065",0,0,"53","52","52065","999","9","1",0,0,"53","006",2,"2","1",12,3,1,2,1,1,1,74,40,20,9,,6,3,52,99,9,5,990,999,70,"99999",1997,"72","72127","72","72127","7440","87",2,,,,"1539",6200,170,80,50,2,1,"1","1539","0",6,"1","7330","0",,,,,,,,,,,,,,,,,,,,,,,,,,,,,,,,,,,,,,,,,,,,,,,,,,,,,,,,,,,,,,,,,,,,,,,,,2,"1539",0,"7330",0,,,,,,,,,,,,,,,,,,,,,,,,,,,,,,,,,,,,
2,2,"52","52065",0,0,"53","52","52011","999","9","1",0,0,"53","006",2,"3","1",9,2,1,2,1,1,1,68,39,19,9,,1,2,52,99,9,4,990,999,450,"99999",1997,"72","72127","72","72021","7440","87",2,,,,"496",22300,580,200,240,3,1,"1","0389","0",2,"1","7991","0",3,"1","496","0",,,,,,,,,,,,,,,,,,,,,,,,,,,,,,,,,,,,,,,,,,,,,,,,,,,,,,,,,,,,,,,,,,,,,3,"0389",0,"496",0,"7991",0,,,,,,,,,,,,,,,,,,,,,,,,,,,,,,,,,,