"rectype","restatus","stateoc","countyoc","region","divstoc","exstatoc","staters","countyrs","cityrs","popsize","metro","regnres","divstres","exstares","pmsares","popsizoc","popsizrs","popmsa","educ","educr","monthdth","sex","race","racer3","racer2","age","ager52","ager27","ager12","ager22","placdth","marstat","statbth","hispanic","hspanicr","weekday","industry","occup","ucr52","fipscity","year","fipssto","fipsctyo","fipsstr","fipsctyr","fipspmsa","fipscmsa","injwork","raceimp","ageflag","accident","ucod","ucr282","ucr72","ucr61","ucr34","eanum","econdp_1","econds_1","enicon_1","enifla_1","econdp_2","econds_2","enicon_2","enifla_2","econdp_3","econds_3","enicon_3","enifla_3","econdp_4","econds_4","enicon_4","enifla_4","econdp_5","econds_5","enicon_5","enifla_5","econdp_6","econds_6","enicon_6","enifla_6","econdp_7","econds_7","enicon_7","enifla_7","econdp_8","econds_8","enicon_8","enifla_8","econdp_9","econds_9","enicon_9","enifla_9","econdp_10","econds_10","enicon_10","enifla_10","econdp_11","econds_11","enicon_11","enifla_11","econdp_12","econds_12","enicon_12","enifla_12","econdp_13","econds_13","enicon_13","enifla_13","econdp_14","econds_14","enicon_14","enifla_14","econdp_15","econds_15","enicon_15","enifla_15","econdp_16","econds_16","enicon_16","enifla_16","econdp_17","econds_17","enicon_17","enifla_17","econdp_18","econds_18","enicon_18","enifla_18","econdp_19","econds_19","enicon_19","enifla_19","econdp_20","econds_20","enicon_20","enifla_20","ranum","record_1","rnifla_1","record_2","rnifla_2","record_3","rnifla_3","record_4","rnifla_4","record_5","rnifla_5","record_6","rnifla_6","record_7","rnifla_7","record_8","rnifla_8","record_9","rnifla_9","record_10","rnifla_10","record_11","rnifla_11","record_12","rnifla_12","record_13","rnifla_13","record_14","rnifla_14","record_15","rnifla_15","record_16","rnifla_16","record_17","rnifla_17","record_18","rnifla_18","record_19","rnifla_19","record_20","rnifla_20"
1,1,"52","52999",0,0,"53","52","52999","999","9","2",0,0,"53","000",9,"9","9",0,1,1,1,1,1,1,84,42,22,10,,6,1,52,99,9,2,990,999,350,"99999",1996,"72","72999","72","72999","0000","00",2,,,,"4029",17000,330,680,160,3,1,"1","4275","0",2,"1","4280","0",3,"1","4019","0",,,,,,,,,,,,,,,,,,,,,,,,,,,,,,,,,,,,,,,,,,,,,,,,,,,,,,,,,,,,,,,,,,,,,2,"4029",0,"4275",0,,,,,,,,,,,,,,,,,,,,,,,,,,,,,,,,,,,,
1,1,"52","52999",0,0,"53","52","52999","999","9","2",0,0,"53","000",9,"9","9",12,3,1,1,1,1,1,71,40,20,9,,6,3,52,99,9,7,990,999,380,"99999",1996,"72","72999","72","72999","0000","00",2,,,,"410",17400,360,680,170,2,1,"1","410","0",2,"1","4140","0",,,,,,,,,,,,,,,,,,,,,,,,,,,,,,,,,,,,,,,,,,,,,,,,,,,,,,,,,,,,,,,,,,,,,,,,,2,"410",0,"4140",0,,,,,,,,,,,,,,,,,,,,,,,,,,,,,,,,,,,,
1,1,"52","52999",0,0,"53","52","52999","999","9","2",0,0,"53","000",9,"9","9",5,1,1,1,1,1,1,75,41,21,10,,6,2,52,99,9,5,990,999,60,"99999",1996,"72","72999","72","72999","0000","00",2,,,,"1519",5500,170,80,50,2,1,"1","4275","0",2,"1","1519","0",,,,,,,,,,,,,,,,,,,,,,,,,,,,,,,,,,,,,,,,,,,,,,,,,,,,,,,,,,,,,,,,,,,,,,,,,2,"1519",0,"4275",0,,,,,,,,,,,,,,,,,,,,,,,,,,,,,,,,,,,,
1,1,"52","52999",0,0,"53","52","52999","999","9","2",0,0,"53","000",9,"9","9",0,1,1,2,1,1,1,84,42,22,10,,2,2,52,99,9,2,990,999,380,"99999",1996,"72","72999","72","72999","0000","00",2,,,,"410",17400,360,680,170,1,1,"1","410","0",,,,,,,,,,,,,,,,,,,,,,,,,,,,,,,,,,,,,,,,,,,,,,,,,,,,,,,,,,,,,,,,,,,,,,,,,,,,,1,"410",0,,,,,,,,,,,,,,,,,,,,,,,,,,,,,,,,,,,,,,
1,1,"52","52999",0,0,"53","52","52999","999","9","1",0,0,"53","006",9,"9","1",4,1,1,1,1,1,1,76,41,21,10,,6,2,52,99,9,2,990,999,130,"99999",1996,"72","72999","72","72999","7440","87",2,,,,"1629",7300,180,80,60,6,1,"1","1629","0",2,"1","4280","0",3,"1","2765","0",4,"1","4280","0",6,"1","797","0",6,"2","2500","0",,,,,,,,,,,,,,,,,,,,,,,,,,,,,,,,,,,,,,,,,,,,,,,,,,,,,,,,,5,"1629",0,"2500",0,"2765",0,"4280",0,"797",0,,,,,,,,,,,,,,,,,,,,,,,,,,,,,,
1,1,"52","52999",0,0,"53","52","52999","999","9","1",0,0,"53","006",9,"9","1",2,1,1,1,2,3,2,79,41,21,10,,6,1,52,99,9,3,990,999,50,"99999",1996,"72","72999","72","72999","7440","87",2,,,,"1509",5400,170,80,50,1,1,"1","1509","0",,,,,,,,,,,,,,,,,,,,,,,,,,,,,,,,,,,,,,,,,,,,,,,,,,,,,,,,,,,,,,,,,,,,,,,,,,,,,1,"1509",0,,,,,,,,,,,,,,,,,,,,,,,,,,,,,,,,,,,,,,
1,1,"52","52999",0,0,"53","52","52999","999","9","1",0,0,"53","006",9,"9","1",3,1,1,2,1,1,1,68,39,19,9,,5,3,52,99,9,2,990,999,320,"99999",1996,"72","72999","72","72999","7440","87",2,,,,"2500",12200,260,680,120,6,1,"1","4289","0",2,"1","4019","0",3,"1","2500","0",4,"1","586","0",6,"1","311","0",6,"2","2449","0",,,,,,,,,,,,,,,,,,,,,,,,,,,,,,,,,,,,,,,,,,,,,,,,,,,,,,,,,4,"2449",0,"2500",0,"311",0,"4049",0,,,,,,,,,,,,,,,,,,,,,,,,,,,,,,,,
1,1,"52","52999",0,0,"53","52","52999","999","9","1",0,0,"53","006",9,"9","1",16,5,1,1,1,1,1,37,33,13,6,,6,1,15,99,9,1,990,999,560,"99999",1996,"72","72999","72","72999","7440","87",2,,,,"0422",2800,140,70,30,4,1,"1","4275","0",2,"1","1739","0",3,"1","0785","0",4,"1","0429","0",,,,,,,,,,,,,,,,,,,,,,,,,,,,,,,,,,,,,,,,,,,,,,,,,,,,,,,,,,,,,,,,,3,"0421",0,"0422",0,"4275",0,,,,,,,,,,,,,,,,,,,,,,,,,,,,,,,,,,
1,1,"52","52999",0,0,"53","52","52999","999","9","1",0,0,"53","006",9,"9","1",12,3,1,1,1,1,1,71,40,20,9,,6,2,52,99,9,2,990,999,450,"99999",1996,"72","72999","72","72999","7440","87",2,,,,"4939",22100,570,200,240,2,1,"1","4275","0",2,"1","4939","0",,,,,,,,,,,,,,,,,,,,,,,,,,,,,,,,,,,,,,,,,,,,,,,,,,,,,,,,,,,,,,,,,,,,,,,,,2,"4275",0,"4939",0,,,,,,,,,,,,,,,,,,,,,,,,,,,,,,,,,,,,
2,2,"52","52999",0,0,"53","52","52999","999","9","1",0,0,"53","006",9,"9","1",3,1,1,1,1,1,1,60,38,18,8,,3,2,52,99,9,3,990,999,380,"99999",1996,"72","72999","72","72999","7440","87",2,,,,"410",17400,360,680,170,3,1,"1","410","0",2,"1","4140","0",3,"1","4019","0",,,,,,,,,,,,,,,,,,,,,,,,,,,,,,,,,,,,,,,,,,,,,,,,,,,,,,,,,,,,,,,,,,,,,3,"4019",0,"410",0,"4140",0,,,,,,,,,,,,,,,,,,,,,,,,,,,,,,,,,,
1,1,"52","52999",0,0,"53","52","52999","999","9","1",0,0,"53","006",9,"9","1",4,1,1,2,1,1,1,87,43,23,11,,6,3,52,99,9,6,990,999,20,"99999",1996,"72","72999","72","72999","7440","87",2,,,,"0389",1900,90,40,30,1,1,"1","0389","0",,,,,,,,,,,,,,,,,,,,,,,,,,,,,,,,,,,,,,,,,,,,,,,,,,,,,,,,,,,,,,,,,,,,,,,,,,,,,1,"0389",0,,,,,,,,,,,,,,,,,,,,,,,,,,,,,,,,,,,,,,
1,1,"52","52999",0,0,"53","52","52999","999","9","1",0,0,"53","006",9,"9","1",4,1,1,2,1,1,1,82,42,22,10,,6,3,52,99,9,2,990,999,400,"99999",1996,"72","72999","72","72999","7440","87",2,,,,"4275",18800,410,680,180,3,1,"1","586","0",2,"1","4289","0",3,"1","4275","0",,,,,,,,,,,,,,,,,,,,,,,,,,,,,,,,,,,,,,,,,,,,,,,,,,,,,,,,,,,,,,,,,,,,,3,"4275",0,"4289",0,"586",0,,,,,,,,,,,,,,,,,,,,,,,,,,,,,,,,,,
1,1,"52","52999",0,0,"53","52","52999","999","9","1",0,0,"53","006",9,"9","1",4,1,1,1,1,1,1,51,36,16,7,,6,2,52,99,9,5,990,999,390,"99999",1996,"72","72999","72","72999","7440","87",2,,,,"412",17700,390,680,170,3,1,"1","4019","0",2,"1","412","0",3,"1","4275","0",,,,,,,,,,,,,,,,,,,,,,,,,,,,,,,,,,,,,,,,,,,,,,,,,,,,,,,,,,,,,,,,,,,,,3,"4019",0,"412",0,"4275",0,,,,,,,,,,,,,,,,,,,,,,,,,,,,,,,,,,
1,1,"52","52999",0,0,"53","52","52999","999","9","1",0,0,"53","006",9,"9","1",12,3,1,2,2,3,2,48,35,15,7,,6,4,52,99,9,7,990,999,380,"99999",1996,"72","72999","72","72999","7440","87",2,,,,"410",17400,360,680,170,4,1,"1","410","0",2,"1","4280","0",3,"1","413","0",4,"1","4280","0",,,,,,,,,,,,,,,,,,,,,,,,,,,,,,,,,,,,,,,,,,,,,,,,,,,,,,,,,,,,,,,,,3,"410",0,"413",0,"4280",0,,,,,,,,,,,,,,,,,,,,,,,,,,,,,,,,,,
1,1,"52","52999",0,0,"53","52","52999","999","9","1",0,0,"53","006",9,"9","1",9,2,1,1,1,1,1,38,33,13,6,,6,1,52,99,9,7,990,999,560,"99999",1996,"72","72999","72","72999","7440","87",2,,,,"0429",2800,140,70,30,4,1,"1","0429","0",2,"1","2639","0",3,"1","485","0",4,"1","4280","0",,,,,,,,,,,,,,,,,,,,,,,,,,,,,,,,,,,,,,,,,,,,,,,,,,,,,,,,,,,,,,,,,4,"0429",0,"2639",0,"4280",0,"485",0,,,,,,,,,,,,,,,,,,,,,,,,,,,,,,,,
1,1,"52","52999",0,0,"53","52","52999","999","9","1",0,0,"53","006",9,"9","1",14,4,1,2,1,1,1,70,40,20,9,,6,3,52,99,9,1,990,999,320,"99999",1996,"72","72999","72","72999","7440","87",2,,,,"2500",12200,260,680,120,6,1,"1","585","0",2,"1","4259","0",3,"1","4019","0",4,"1","2500","0",6,"1","2859","0",6,"2","4275","0",,,,,,,,,,,,,,,,,,,,,,,,,,,,,,,,,,,,,,,,,,,,,,,,,,,,,,,,,5,"2500",0,"2859",0,"4039",0,"4049",0,"4275",0,,,,,,,,,,,,,,,,,,,,,,,,,,,,,,
1,1,"52","52999",0,0,"53","52","52999","999","9","1",0,0,"53","006",9,"9","1",6,1,1,2,1,1,1,68,39,19,9,,6,2,52,99,9,1,990,999,210,"99999",1996,"72","72999","72","72999","7440","87",2,,,,"1830",8500,200,80,80,3,1,"1","1830","0",1,"2","1970","0",1,"3","1977","0",,,,,,,,,,,,,,,,,,,,,,,,,,,,,,,,,,,,,,,,,,,,,,,,,,,,,,,,,,,,,,,,,,,,,3,"1830",0,"1970",0,"1977",0,,,,,,,,,,,,,,,,,,,,,,,,,,,,,,,,,,
1,1,"52","52999",0,0,"53","52","52999","999","9","1",0,0,"53","006",9,"9","1",0,1,1,2,1,1,1,96,45,25,11,,6,3,52,99,9,2,990,999,400,"99999",1996,"72","72999","72","72999","7440","87",2,,,,"4254",18800,410,680,180,5,1,"1","4275","0",2,"1","4254","0",3,"1","261","0",4,"1","4280","0",6,"1","797","0",,,,,,,,,,,,,,,,,,,,,,,,,,,,,,,,,,,,,,,,,,,,,,,,,,,,,,,,,,,,,5,"261",0,"4254",0,"4275",0,"4280",0,"797",0,,,,,,,,,,,,,,,,,,,,,,,,,,,,,,
1,1,"52","52999",0,0,"53","52","52999","999","9","1",0,0,"53","006",9,"9","1",9,2,1,2,1,1,1,68,39,19,9,,6,2,52,99,9,3,990,999,320,"99999",1996,"72","72999","72","72999","7440","87",2,,,,"2500",12200,260,680,120,2,1,"1","436","0",2,"1","2500","0",,,,,,,,,,,,,,,,,,,,,,,,,,,,,,,,,,,,,,,,,,,,,,,,,,,,,,,,,,,,,,,,,,,,,,,,,2,"2500",0,"436",0,,,,,,,,,,,,,,,,,,,,,,,,,,,,,,,,,,,,
1,1,"52","52999",0,0,"53","52","52999","999","9","1",0,0,"53","006",9,"9","1",5,1,1,2,1,1,1,68,39,19,9,,5,4,52,99,9,3,990,999,560,"99999",1996,"72","72999","72","72999","7440","87",2,,,,"3310",15300,780,140,320,5,1,"1","7991","0",2,"1","3310","0",3,"1","4019","0",4,"1","5188","0",6,"1","3489","0",,,,,,,,,,,,,,,,,,,,,,,,,,,,,,,,,,,,,,,,,,,,,,,,,,,,,,,,,,,,,4,"3310",0,"4019",0,"5188",0,"7991",0,,,,,,,,,,,,,,,,,,,,,,,,,,,,,,,,
1,1,"52","52999",0,0,"53","52","52999","999","9","1",0,0,"53","006",9,"9","1",6,1,1,1,2,3,2,70,40,20,9,,6,2,52,99,9,4,990,999,220,"99999",1996,"72","72999","72","72999","7440","87",2,,,,"185",8700,200,80,80,2,1,"1","185","0",6,"1","2500","0",,,,,,,,,,,,,,,,,,,,,,,,,,,,,,,,,,,,,,,,,,,,,,,,,,,,,,,,,,,,,,,,,,,,,,,,,2,"185",0,"2500",0,,,,,,,,,,,,,,,,,,,,,,,,,,,,,,,,,,,,
1,1,"52","52999",0,0,"53","52","52999","999","9","1",0,0,"53","006",9,"9","1",0,1,1,2,2,3,2,92,44,24,11,,2,3,52,99,9,5,990,999,560,"99999",1996,"72","72999","72","72999","7440","87",2,,,,"4410",19900,490,680,220,5,1,"1","4275","0",2,"1","4280","0",3,"1","4410","0",6,"1","5621","0",6,"2","5339","0",,,,,,,,,,,,,,,,,,,,,,,,,,,,,,,,,,,,,,,,,,,,,,,,,,,,,,,,,,,,,5,"4275",0,"4280",0,"4410",0,"5339",0,"5621",0,,,,,,,,,,,,,,,,,,,,,,,,,,,,,,
2,2,"52","52999",0,0,"53","52","52011","999","9","1",0,0,"53","006",9,"3","1",11,2,1,2,1,1,1,63,38,18,8,,3,2,52,99,9,2,990,999,400,"99999",1996,"72","72999","72","72021","7440","87",2,,,,"4289",18600,410,680,180,3,1,"1","4289","0",6,"1","9599","1",6,"2","885","0",,,,,,,,,,,,,,,,,,,,,,,,,,,,,,,,,,,,,,,,,,,,,,,,,,,,,,,,,,,,,,,,,,,,,3,"4289",0,"885",0,"9599",1,,,,,,,,,,,,,,,,,,,,,,,,,,,,,,,,,,
1,1,"52","52999",0,0,"53","52","52999","999","9","2",0,0,"53","000",9,"9","9",11,2,1,1,1,1,1,46,35,15,7,,6,1,52,99,9,4,990,999,380,"99999",1996,"72","72999","72","72999","0000","00",2,,,,"410",17400,360,680,170,2,1,"1","4275","0",2,"1","410","0",,,,,,,,,,,,,,,,,,,,,,,,,,,,,,,,,,,,,,,,,,,,,,,,,,,,,,,,,,,,,,,,,,,,,,,,,2,"410",0,"4275",0,,,,,,,,,,,,,,,,,,,,,,,,,,,,,,,,,,,,
1,1,"52","52999",0,0,"53","52","52999","999","9","2",0,0,"53","000",9,"9","9",4,1,1,2,1,1,1,89,43,23,11,,6,3,52,99,9,1,990,999,380,"99999",1996,"72","72999","72","72999","0000","00",2,,,,"410",17400,360,680,170,2,1,"1","4275","0",2,"1","410","0",,,,,,,,,,,,,,,,,,,,,,,,,,,,,,,,,,,,,,,,,,,,,,,,,,,,,,,,,,,,,,,,,,,,,,,,,2,"410",0,"4275",0,,,,,,,,,,,,,,,,,,,,,,,,,,,,,,,,,,,,
1,1,"52","52999",0,0,"53","52","52999","999","9","2",0,0,"53","000",9,"9","9",6,1,1,1,1,1,1,87,43,23,11,,6,2,52,99,9,3,990,999,420,"99999",1996,"72","72999","72","72999","0000","00",2,,,,"436",19500,470,680,200,4,1,"1","4378","0",2,"1","436","0",3,"1","4019","0",6,"1","2449","0",,,,,,,,,,,,,,,,,,,,,,,,,,,,,,,,,,,,,,,,,,,,,,,,,,,,,,,,,,,,,,,,,4,"2449",0,"4019",0,"436",0,"4378",0,,,,,,,,,,,,,,,,,,,,,,,,,,,,,,,,
1,1,"52","52999",0,0,"53","52","52999","999","9","2",0,0,"53","000",9,"9","9",3,1,1,2,1,1,1,65,39,19,9,,3,2,52,99,9,3,990,999,560,"99999",1996,"72","72999","72","72999","0000","00",2,,,,"5184",22700,780,200,320,4,1,"1","4275","0",2,"1","410","0",3,"1","4280","0",4,"1","5184","0",,,,,,,,,,,,,,,,,,,,,,,,,,,,,,,,,,,,,,,,,,,,,,,,,,,,,,,,,,,,,,,,,4,"410",0,"4275",0,"4280",0,"5184",0,,,,,,,,,,,,,,,,,,,,,,,,,,,,,,,,
1,1,"52","52999",0,0,"53","52","52999","999","9","2",0,0,"53","000",9,"9","9",6,1,1,1,1,1,1,75,41,21,10,,6,3,52,99,9,4,990,999,110,"99999",1996,"72","72999","72","72999","0000","00",2,,,,"1579",6900,170,80,50,5,1,"1","4275","0",2,"1","1579","0",3,"1","585","0",6,"1","2503","0",6,"2","4280","0",,,,,,,,,,,,,,,,,,,,,,,,,,,,,,,,,,,,,,,,,,,,,,,,,,,,,,,,,,,,,5,"1579",0,"2503",0,"4275",0,"4280",0,"585",0,,,,,,,,,,,,,,,,,,,,,,,,,,,,,,
1,1,"52","52999",0,0,"53","52","52999","999","9","2",0,0,"53","000",9,"9","9",12,3,1,2,1,1,1,77,41,21,10,,6,1,52,99,9,2,990,999,400,"99999",1996,"72","72999","72","72999","0000","00",2,,,,"4275",18800,410,680,180,2,1,"1","4275","0",1,"2","4280","0",,,,,,,,,,,,,,,,,,,,,,,,,,,,,,,,,,,,,,,,,,,,,,,,,,,,,,,,,,,,,,,,,,,,,,,,,2,"4275",0,"4280",0,,,,,,,,,,,,,,,,,,,,,,,,,,,,,,,,,,,,
2,2,"52","52999",0,0,"53","52","52999","999","9","1",0,0,"53","006",9,"9","1",3,1,1,1,1,1,1,86,43,23,11,,6,2,52,99,9,2,990,999,450,"99999",1996,"72","72999","72","72999","7440","87",2,,,,"4939",22100,570,200,240,3,1,"1","7991","0",2,"1","4939","0",3,"1","185","0",,,,,,,,,,,,,,,,,,,,,,,,,,,,,,,,,,,,,,,,,,,,,,,,,,,,,,,,,,,,,,,,,,,,,3,"185",0,"4939",0,"7991",0,,,,,,,,,,,,,,,,,,,,,,,,,,,,,,,,,,
1,1,"52","52999",0,0,"53","52","52999","999","9","1",0,0,"53","006",9,"9","1",8,1,1,2,1,1,1,92,44,24,11,,6,3,52,99,9,6,990,999,450,"99999",1996,"72","72999","72","72999","7440","87",2,,,,"4912",21900,550,160,240,3,1,"1","485","0",2,"1","490","0",3,"1","492","0",,,,,,,,,,,,,,,,,,,,,,,,,,,,,,,,,,,,,,,,,,,,,,,,,,,,,,,,,,,,,,,,,,,,,2,"485",0,"4912",0,,,,,,,,,,,,,,,,,,,,,,,,,,,,,,,,,,,,
1,1,"52","52999",0,0,"53","52","52999","999","9","1",0,0,"53","006",9,"9","1",5,1,1,1,1,1,1,84,42,22,10,,6,1,52,99,9,1,990,999,50,"99999",1996,"72","72999","72","72999","7440","87",2,,,,"1509",5400,170,80,50,5,1,"1","1509","0",1,"2","7991","0",2,"1","2859","0",2,"2","2639","0",3,"1","4939","0",,,,,,,,,,,,,,,,,,,,,,,,,,,,,,,,,,,,,,,,,,,,,,,,,,,,,,,,,,,,,5,"1509",0,"2639",0,"2859",0,"4939",0,"7991",0,,,,,,,,,,,,,,,,,,,,,,,,,,,,,,
1,1,"52","52999",0,0,"53","52","52999","999","9","1",0,0,"53","006",9,"9","1",6,1,1,1,1,1,1,36,33,13,6,,6,4,52,99,9,1,990,999,560,"99999",1996,"72","72999","72","72999","7440","87",2,,,,"0429",2800,140,70,30,4,1,"1","4275","0",2,"1","7803","0",3,"1","0429","0",6,"1","486","0",,,,,,,,,,,,,,,,,,,,,,,,,,,,,,,,,,,,,,,,,,,,,,,,,,,,,,,,,,,,,,,,,4,"0429",0,"4275",0,"486",0,"7803",0,,,,,,,,,,,,,,,,,,,,,,,,,,,,,,,,
1,1,"52","52999",0,0,"53","52","52999","999","9","1",0,0,"53","006",9,"9","1",2,1,1,1,1,1,1,82,42,22,10,,6,2,52,99,9,4,990,999,380,"99999",1996,"72","72999","72","72999","7440","87",2,,,,"410",17400,360,680,170,3,1,"1","410","0",2,"1","413","0",3,"1","4019","0",,,,,,,,,,,,,,,,,,,,,,,,,,,,,,,,,,,,,,,,,,,,,,,,,,,,,,,,,,,,,,,,,,,,,3,"4019",0,"410",0,"413",0,,,,,,,,,,,,,,,,,,,,,,,,,,,,,,,,,,
1,1,"52","52999",0,0,"53","52","52999","999","9","1",0,0,"53","006",9,"9","1",0,1,1,1,1,1,1,77,41,21,10,,6,1,52,99,9,1,990,999,420,"99999",1996,"72","72999","72","72999","7440","87",2,,,,"436",19500,470,680,200,4,1,"1","7991","0",2,"1","436","0",3,"1","438","0",4,"1","4370","0",,,,,,,,,,,,,,,,,,,,,,,,,,,,,,,,,,,,,,,,,,,,,,,,,,,,,,,,,,,,,,,,,4,"436",0,"4370",0,"438",0,"7991",0,,,,,,,,,,,,,,,,,,,,,,,,,,,,,,,,
1,1,"52","52999",0,0,"53","52","52999","999","9","1",0,0,"53","006",9,"9","1",5,1,1,2,1,1,1,82,42,22,10,,6,3,52,99,9,3,990,999,170,"99999",1996,"72","72999","72","72999","7440","87",2,,,,"1729",7800,220,80,110,3,1,"1","1729","0",2,"1","1991","0",3,"1","486","0",,,,,,,,,,,,,,,,,,,,,,,,,,,,,,,,,,,,,,,,,,,,,,,,,,,,,,,,,,,,,,,,,,,,,3,"1729",0,"1991",0,"486",0,,,,,,,,,,,,,,,,,,,,,,,,,,,,,,,,,,
1,1,"52","52999",0,0,"53","52","52999","999","9","1",0,0,"53","006",9,"9","1",7,1,1,1,1,1,1,57,37,17,8,,6,2,52,99,9,5,990,999,120,"99999",1996,"72","72999","72","72999","7440","87",2,,,,"1619",7200,180,80,60,4,1,"1","7855","0",2,"1","4472","0",3,"1","1991","0",4,"1","1619","0",,,,,,,,,,,,,,,,,,,,,,,,,,,,,,,,,,,,,,,,,,,,,,,,,,,,,,,,,,,,,,,,,4,"1619",0,"1991",0,"4472",0,"7855",0,,,,,,,,,,,,,,,,,,,,,,,,,,,,,,,,
1,1,"52","52999",0,0,"53","52","52999","999","9","1",0,0,"53","006",9,"9","1",1,1,1,1,1,1,1,68,39,19,9,,6,2,52,99,9,3,990,999,380,"99999",1996,"72","72999","72","72999","7440","87",2,,,,"410",17400,360,680,170,3,1,"1","410","0",2,"1","4019","0",3,"1","4409","0",,,,,,,,,,,,,,,,,,,,,,,,,,,,,,,,,,,,,,,,,,,,,,,,,,,,,,,,,,,,,,,,,,,,,3,"4019",0,"410",0,"4409",0,,,,,,,,,,,,,,,,,,,,,,,,,,,,,,,,,,
1,1,"52","52999",0,0,"53","52","52999","999","9","1",0,0,"53","006",9,"9","1",0,1,1,1,1,1,1,78,41,21,10,,6,1,52,99,9,4,990,999,450,"99999",1996,"72","72999","72","72999","7440","87",2,,,,"4939",22100,570,200,240,3,1,"1","7991","0",2,"1","4939","0",3,"1","7991","0",,,,,,,,,,,,,,,,,,,,,,,,,,,,,,,,,,,,,,,,,,,,,,,,,,,,,,,,,,,,,,,,,,,,,2,"4939",0,"7991",0,,,,,,,,,,,,,,,,,,,,,,,,,,,,,,,,,,,,
1,1,"52","52999",0,0,"53","52","52999","999","9","2",0,0,"53","000",9,"9","9",0,1,1,2,1,1,1,66,39,19,9,,6,2,52,99,9,2,990,999,90,"99999",1996,"72","72999","72","72999","0000","00",2,,,,"1552",6700,170,80,50,1,1,"1","1552","0",,,,,,,,,,,,,,,,,,,,,,,,,,,,,,,,,,,,,,,,,,,,,,,,,,,,,,,,,,,,,,,,,,,,,,,,,,,,,1,"1552",0,,,,,,,,,,,,,,,,,,,,,,,,,,,,,,,,,,,,,,
1,1,"52","52999",0,0,"53","52","52999","999","9","2",0,0,"53","000",9,"9","9",3,1,1,1,1,1,1,79,41,21,10,,6,3,52,99,9,3,990,999,50,"99999",1996,"72","72999","72","72999","0000","00",2,,,,"1509",5400,170,80,50,1,1,"1","1509","0",,,,,,,,,,,,,,,,,,,,,,,,,,,,,,,,,,,,,,,,,,,,,,,,,,,,,,,,,,,,,,,,,,,,,,,,,,,,,1,"1509",0,,,,,,,,,,,,,,,,,,,,,,,,,,,,,,,,,,,,,,
1,1,"52","52999",0,0,"53","52","52999","999","9","2",0,0,"53","000",9,"9","9",2,1,1,1,1,1,1,77,41,21,10,,6,2,52,99,9,6,990,999,320,"99999",1996,"72","72999","72","72999","0000","00",2,,,,"2500",12200,260,680,120,2,1,"1","4275","0",2,"1","2500","0",,,,,,,,,,,,,,,,,,,,,,,,,,,,,,,,,,,,,,,,,,,,,,,,,,,,,,,,,,,,,,,,,,,,,,,,,2,"2500",0,"4275",0,,,,,,,,,,,,,,,,,,,,,,,,,,,,,,,,,,,,
1,1,"52","52999",0,0,"53","52","52999","999","9","2",0,0,"53","000",9,"9","9",0,1,1,1,2,3,2,68,39,19,9,,6,3,52,99,9,7,990,999,110,"99999",1996,"72","72999","72","72999","0000","00",2,,,,"1579",6900,170,80,50,2,1,"1","4275","0",2,"1","1579","0",,,,,,,,,,,,,,,,,,,,,,,,,,,,,,,,,,,,,,,,,,,,,,,,,,,,,,,,,,,,,,,,,,,,,,,,,2,"1579",0,"4275",0,,,,,,,,,,,,,,,,,,,,,,,,,,,,,,,,,,,,
1,1,"52","52999",0,0,"53","52","52999","999","9","2",0,0,"53","000",9,"9","9",6,1,1,1,1,1,1,83,42,22,10,,6,2,52,99,9,3,990,999,220,"99999",1996,"72","72999","72","72999","0000","00",2,,,,"185",8700,200,80,80,4,1,"1","2859","0",2,"1","1990","0",3,"1","185","0",6,"1","4019","0",,,,,,,,,,,,,,,,,,,,,,,,,,,,,,,,,,,,,,,,,,,,,,,,,,,,,,,,,,,,,,,,,4,"185",0,"1990",0,"2859",0,"4019",0,,,,,,,,,,,,,,,,,,,,,,,,,,,,,,,,
1,1,"52","52999",0,0,"53","52","52999","999","9","2",0,0,"53","000",9,"9","9",2,1,1,1,1,1,1,67,39,19,9,,6,3,52,99,9,1,990,999,480,"99999",1996,"72","72999","72","72999","0000","00",2,,,,"5713",24200,620,230,260,4,1,"1","7991","0",2,"1","5722","0",3,"1","5719","0",4,"1","303","0",,,,,,,,,,,,,,,,,,,,,,,,,,,,,,,,,,,,,,,,,,,,,,,,,,,,,,,,,,,,,,,,,4,"303",0,"5719",0,"5722",0,"7991",0,,,,,,,,,,,,,,,,,,,,,,,,,,,,,,,,
1,1,"52","52999",0,0,"53","52","52999","999","9","2",0,0,"53","000",9,"9","9",0,1,1,2,1,1,1,86,43,23,11,,1,3,52,99,9,2,990,999,560,"99999",1996,"72","72999","72","72999","0000","00",2,,,,"2765",12800,780,680,320,5,1,"1","7991","0",2,"1","0389","0",3,"1","2765","0",4,"1","797","0",6,"1","496","0",,,,,,,,,,,,,,,,,,,,,,,,,,,,,,,,,,,,,,,,,,,,,,,,,,,,,,,,,,,,,5,"0389",0,"2765",0,"496",0,"797",0,"7991",0,,,,,,,,,,,,,,,,,,,,,,,,,,,,,,
1,1,"52","52999",0,0,"53","52","52999","999","9","2",0,0,"53","000",9,"9","9",4,1,1,2,1,1,1,87,43,23,11,,6,3,52,99,9,7,990,999,320,"99999",1996,"72","72999","72","72999","0000","00",2,,,,"2500",12200,260,680,120,3,1,"1","4275","0",2,"1","586","0",3,"1","2500","0",,,,,,,,,,,,,,,,,,,,,,,,,,,,,,,,,,,,,,,,,,,,,,,,,,,,,,,,,,,,,,,,,,,,,3,"2500",0,"4275",0,"586",0,,,,,,,,,,,,,,,,,,,,,,,,,,,,,,,,,,
1,1,"52","52999",0,0,"53","52","52999","999","9","2",0,0,"53","000",9,"9","9",4,1,1,2,1,1,1,76,41,21,10,,6,2,52,99,9,3,990,999,400,"99999",1996,"72","72999","72","72999","0000","00",2,,,,"4280",18600,410,680,180,1,1,"1","4280","0",,,,,,,,,,,,,,,,,,,,,,,,,,,,,,,,,,,,,,,,,,,,,,,,,,,,,,,,,,,,,,,,,,,,,,,,,,,,,1,"4280",0,,,,,,,,,,,,,,,,,,,,,,,,,,,,,,,,,,,,,,
1,1,"52","52999",0,0,"53","52","52999","999","9","2",0,0,"53","000",9,"9","9",14,4,1,2,1,1,1,58,37,17,8,,6,2,52,99,9,4,990,999,180,"99999",1996,"72","72999","72","72999","0000","00",2,,,,"1749",8000,190,80,70,3,1,"1","4275","0",2,"1","1749","0",3,"1","4019","0",,,,,,,,,,,,,,,,,,,,,,,,,,,,,,,,,,,,,,,,,,,,,,,,,,,,,,,,,,,,,,,,,,,,,3,"1749",0,"4019",0,"4275",0,,,,,,,,,,,,,,,,,,,,,,,,,,,,,,,,,,
1,1,"52","52999",0,0,"53","52","52999","999","9","2",0,0,"53","000",9,"9","9",2,1,1,1,1,1,1,88,43,23,11,,6,2,52,99,9,5,990,999,400,"99999",1996,"72","72999","72","72999","0000","00",2,,,,"4275",18800,410,680,180,1,1,"1","4275","0",,,,,,,,,,,,,,,,,,,,,,,,,,,,,,,,,,,,,,,,,,,,,,,,,,,,,,,,,,,,,,,,,,,,,,,,,,,,,1,"4275",0,,,,,,,,,,,,,,,,,,,,,,,,,,,,,,,,,,,,,,
1,1,"52","52999",0,0,"53","52","52999","999","9","2",0,0,"53","000",9,"9","9",4,1,1,2,1,1,1,69,39,19,9,,6,1,52,99,9,6,990,999,400,"99999",1996,"72","72999","72","72999","0000","00",2,,,,"4280",18600,410,680,180,2,1,"1","4275","0",2,"1","4280","0",,,,,,,,,,,,,,,,,,,,,,,,,,,,,,,,,,,,,,,,,,,,,,,,,,,,,,,,,,,,,,,,,,,,,,,,,2,"4275",0,"4280",0,,,,,,,,,,,,,,,,,,,,,,,,,,,,,,,,,,,,
1,1,"52","52999",0,0,"53","52","52999","999","9","2",0,0,"53","000",9,"9","9",8,1,1,2,1,1,1,57,37,17,8,,6,3,52,99,9,3,990,999,380,"99999",1996,"72","72999","72","72999","0000","00",2,,,,"410",17400,360,680,170,5,1,"1","4292","0",2,"1","410","0",3,"1","4149","0",6,"1","2500","0",6,"2","4439","0",,,,,,,,,,,,,,,,,,,,,,,,,,,,,,,,,,,,,,,,,,,,,,,,,,,,,,,,,,,,,4,"2506",0,"410",0,"4149",0,"4292",0,,,,,,,,,,,,,,,,,,,,,,,,,,,,,,,,
1,1,"52","52999",0,0,"53","52","52999","999","9","2",0,0,"53","000",9,"9","9",4,1,1,2,1,1,1,90,44,24,11,,6,3,52,99,9,3,990,999,560,"99999",1996,"72","72999","72","72999","0000","00",2,,,,"2859",13800,280,120,320,4,1,"1","7991","0",2,"1","2859","0",3,"1","797","0",4,"1","496","0",,,,,,,,,,,,,,,,,,,,,,,,,,,,,,,,,,,,,,,,,,,,,,,,,,,,,,,,,,,,,,,,,4,"2859",0,"496",0,"797",0,"7991",0,,,,,,,,,,,,,,,,,,,,,,,,,,,,,,,,
1,1,"52","52999",0,0,"53","52","52999","999","9","2",0,0,"53","000",9,"9","9",6,1,1,1,1,1,1,62,38,18,8,,6,2,52,99,9,2,990,999,40,"99999",1996,"72","72999","72","72999","0000","00",2,,,,"1490",5100,160,80,110,1,1,"1","1490","0",,,,,,,,,,,,,,,,,,,,,,,,,,,,,,,,,,,,,,,,,,,,,,,,,,,,,,,,,,,,,,,,,,,,,,,,,,,,,1,"1490",0,,,,,,,,,,,,,,,,,,,,,,,,,,,,,,,,,,,,,,
1,1,"52","52999",0,0,"53","52","52999","999","9","2",0,0,"53","000",9,"9","9",0,1,1,2,1,1,1,97,45,25,11,,6,3,52,99,9,1,990,999,420,"99999",1996,"72","72999","72","72999","0000","00",2,,,,"436",19500,470,680,200,3,1,"1","436","0",6,"1","7159","0",6,"2","4939","0",,,,,,,,,,,,,,,,,,,,,,,,,,,,,,,,,,,,,,,,,,,,,,,,,,,,,,,,,,,,,,,,,,,,,3,"436",0,"4939",0,"7159",0,,,,,,,,,,,,,,,,,,,,,,,,,,,,,,,,,,